program: Orca
programVersion: 5.0.2
elementType: O O O C C C C C C C C C C C C C C C C C C C C C C H H H H H H H H H H H H H H H H H H H H H H H H H H
charge: 0
multiplicity: 1
keywords: wb97x-d3
keywords: def2-TZVPP
keywords: def2/J RIJCOSX
keywords: DEFGRID2
keywords: scfconv7
keywords: smallprint printgap noloewdin
keywords: NOSOSCF
formula: C22H26O3
InChI: InChI=1/C22H26O3/c1-15(2)10-19-20(22(19,3)4)21(23)25-14-17-12-18(24-13-17)11-16-8-6-5-7-9-16/h5-10,12-13,19-20H,11,14H2,1-4H3
51 atoms
O  1.597949 -1.752419 0.528075
O  1.441182 -1.304184 -1.656107
O  -2.642417 -2.425352 -0.509094
C  1.901719 1.626421 -0.578968
C  3.13128 1.107155 -1.264571
C  2.47431 0.274353 -0.183886
C  2.04062 2.72616 0.445505
C  0.614953 1.713622 -1.362227
C  4.472565 1.672832 -1.010547
C  1.790495 -0.981772 -0.542313
C  5.330808 2.133116 -1.926786
C  6.664963 2.680771 -1.516073
C  5.070178 2.17113 -3.401432
C  0.875441 -2.983801 0.34326
C  -0.589685 -2.741844 0.271084
C  -1.474107 -2.490671 1.369559
C  -1.359032 -2.684442 -0.841409
C  -2.706775 -2.306401 0.842384
C  -4.02336 -1.967221 1.445693
C  -4.246071 -0.47518 1.531151
C  -4.509726 0.274609 0.386534
C  -4.167649 0.178211 2.757148
C  -4.688503 1.648281 0.468145
C  -4.34935 1.552724 2.842114
C  -4.6088 2.292298 1.69701
H  2.953749 0.747075 -2.272508
H  2.969017 0.255898 0.781219
H  2.106274 3.69753 -0.04899
H  2.923763 2.61256 1.072353
H  1.169899 2.749046 1.103125
H  -0.248834 1.537482 -0.717836
H  0.565093 1.012113 -2.191969
H  0.510341 2.716451 -1.780252
H  4.780285 1.715433 0.030343
H  7.479304 2.128271 -1.991979
H  6.774735 3.721966 -1.830716
H  6.813628 2.637214 -0.437329
H  4.120054 1.728092 -3.693075
H  5.076601 3.203598 -3.760659
H  5.862995 1.652987 -3.946493
H  1.124572 -3.579421 1.219507
H  1.239344 -3.513565 -0.537145
H  -1.214553 -2.459397 2.416344
H  -1.143814 -2.819875 -1.889603
H  -4.062018 -2.399275 2.446229
H  -4.824629 -2.434996 0.868446
H  -4.580602 -0.217608 -0.576294
H  -3.966214 -0.394712 3.654631
H  -4.893869 2.217638 -0.429246
H  -4.289996 2.043987 3.804857
H  -4.751532 3.363168 1.760754
elementType: O C H
totalener: -1079.74068315 hartree
nucrepener: 2090.30280861 hartree
electener: -3170.04349176 hartree
oneelecener: -5620.26727175 hartree
twoeener: 2450.22377999 hartree
cpcmener: -0.02991973 hartree
kineticenergy: 1074.84947223 hartree
xcener: -106.459582750663 hartree
chargesum: -0.0000000
charge: -0.290249 -0.501736 -0.283248 0.112961 0.039004 -0.110584 -0.267230 -0.280054 -0.287452 0.419562 -0.047883 -0.219339 -0.250628 0.091611 -0.085057 -0.333164 -0.019234 0.217448 -0.057015 0.031175 -0.204702 -0.188343 -0.159362 -0.153619 -0.177215 0.091955 0.091399 0.097440 0.088693 0.098405 0.098943 0.090967 0.097857 0.121882 0.093640 0.093459 0.088656 0.089523 0.097276 0.095020 0.122313 0.121625 0.164923 0.173728 0.105091 0.116246 0.140859 0.143009 0.160233 0.159933 0.161278
qa: -0.2902 -0.5017 -0.2832 0.1130 0.0390 -0.1106 -0.2672 -0.2801 -0.2875 0.4196 -0.0479 -0.2193 -0.2506 0.0916 -0.0851 -0.3332 -0.0192 0.2174 -0.0570 0.0312 -0.2047 -0.1883 -0.1594 -0.1536 -0.1772 0.0920 0.0914 0.0974 0.0887 0.0984 0.0989 0.0910 0.0979 0.1219 0.0936 0.0935 0.0887 0.0895 0.0973 0.0950 0.1223 0.1216 0.1649 0.1737 0.1051 0.1162 0.1409 0.1430 0.1602 0.1599 0.1613
va: 2.1218 1.9977 2.2686 3.6845 3.7623 3.8665 3.9058 3.9045 3.8640 4.1487 3.7537 3.9203 3.9421 3.8105 3.6236 3.9925 3.9411 3.5982 3.8041 3.6218 3.9442 3.9284 3.8991 3.8854 3.8943 1.0334 1.0367 1.0019 1.0056 1.0020 0.9991 1.0184 1.0009 1.0088 0.9964 0.9961 1.0086 1.0096 0.9969 0.9972 0.9937 1.0099 1.0063 1.0028 1.0103 1.0100 1.0136 1.0031 0.9902 0.9901 0.9894
dispcorr: -0.022421374 hartree
energy: -1079.763104523848
dipole: 21.05641 -20.86250 0.19391 20.52177 -20.16522 0.35654 -5.68052 6.75151 1.07100
magnitude: 1.14532 au
magnitude: 2.91117 debye
