program: Orca
programVersion: 5.0.2
elementType: O O O C C C C C C C C C C C C C C C C C C C C C C H H H H H H H H H H H H H H H H H H H H H H H H H H
charge: 0
multiplicity: 1
keywords: wb97x-d3
keywords: def2-TZVPP
keywords: def2/J RIJCOSX
keywords: DEFGRID2
keywords: scfconv7
keywords: smallprint printgap noloewdin
keywords: NOSOSCF
formula: C22H26O3
InChI: InChI=1/C22H26O3/c1-15(2)10-19-20(22(19,3)4)21(23)25-14-17-12-18(24-13-17)11-16-8-6-5-7-9-16/h5-10,12-13,19-20H,11,14H2,1-4H3
51 atoms
O  1.626928 -1.734953 -0.708671
O  1.942729 -1.638961 1.504009
O  -2.592634 -2.325234 -0.629508
C  1.217159 1.348297 -0.105801
C  2.32091 1.048415 -1.083192
C  2.283547 0.321764 0.2410
C  1.236439 2.629652 0.690751
C  -0.183309 0.895146 -0.447485
C  3.430591 1.990659 -1.334097
C  1.941002 -1.103486 0.41592
C  3.897485 2.37795 -2.525592
C  5.051035 3.331034 -2.623129
C  3.354633 1.927975 -3.847398
C  0.987814 -3.027092 -0.621546
C  -0.454998 -2.839761 -0.318201
C  -1.073967 -2.625366 0.956055
C  -1.430567 -2.648592 -1.237493
C  -2.365202 -2.3054 0.709788
C  -3.4535 -1.796101 1.585143
C  -3.370541 -0.288435 1.657827
C  -3.930234 0.504873 0.659843
C  -2.651822 0.32546 2.67976
C  -3.769984 1.884122 0.681181
C  -2.491649 1.70452 2.704561
C  -3.047913 2.488214 1.702101
H  1.999627 0.465406 -1.938515
H  2.992627 0.658875 0.990273
H  0.839095 3.454422 0.09558
H  2.234646 2.909167 1.024764
H  0.606915 2.532718 1.577998
H  -0.720924 0.57449 0.447722
H  -0.205898 0.080093 -1.168553
H  -0.740397 1.726289 -0.883594
H  3.915687 2.395693 -0.450216
H  5.876049 2.889737 -3.188585
H  4.765153 4.240988 -3.157105
H  5.431698 3.620023 -1.643615
H  3.072174 2.790729 -4.456414
H  4.119763 1.390909 -4.414853
H  2.482722 1.281102 -3.770733
H  1.492006 -3.659285 0.108326
H  1.12572 -3.469039 -1.60607
H  -0.612477 -2.681591 1.928616
H  -1.440766 -2.706082 -2.314972
H  -3.332722 -2.22594 2.579873
H  -4.428283 -2.112727 1.208829
H  -4.495294 0.043214 -0.141332
H  -2.207727 -0.28211 3.459707
H  -4.209798 2.487865 -0.102251
H  -1.930397 2.166446 3.506696
H  -2.921936 3.562927 1.717903
elementType: O C H
totalener: -1079.73722336 hartree
nucrepener: 2208.77887859 hartree
electener: -3288.51610195 hartree
oneelecener: -5856.96508181 hartree
twoeener: 2568.44897986 hartree
cpcmener: -0.03078766 hartree
kineticenergy: 1074.85348962 hartree
xcener: -106.463190238448 hartree
chargesum: 0.0000000
charge: -0.280435 -0.496865 -0.278428 0.176854 0.057352 -0.113786 -0.294762 -0.305782 -0.306130 0.420666 -0.045016 -0.222081 -0.253790 0.052525 -0.073322 -0.314973 -0.035140 0.203161 -0.042827 0.040826 -0.202204 -0.169070 -0.158984 -0.173512 -0.170754 0.099271 0.092481 0.098302 0.092471 0.094244 0.059759 0.100747 0.108393 0.120418 0.093105 0.094310 0.088668 0.095152 0.097271 0.089244 0.121813 0.121173 0.158651 0.178340 0.108656 0.111711 0.140625 0.141772 0.159365 0.160250 0.160284
qa: -0.2804 -0.4969 -0.2784 0.1769 0.0574 -0.1138 -0.2948 -0.3058 -0.3061 0.4207 -0.0450 -0.2221 -0.2538 0.0525 -0.0733 -0.3150 -0.0351 0.2032 -0.0428 0.0408 -0.2022 -0.1691 -0.1590 -0.1735 -0.1708 0.0993 0.0925 0.0983 0.0925 0.0942 0.0598 0.1007 0.1084 0.1204 0.0931 0.0943 0.0887 0.0952 0.0973 0.0892 0.1218 0.1212 0.1587 0.1783 0.1087 0.1117 0.1406 0.1418 0.1594 0.1603 0.1603
va: 2.1145 1.9933 2.2630 3.5927 3.7457 3.8441 3.9115 3.9285 3.8614 4.1611 3.7581 3.9215 3.9416 3.8584 3.6522 3.9454 3.9336 3.6346 3.8130 3.6015 3.9153 3.8706 3.8672 3.8618 3.8449 1.0254 1.0335 1.0006 1.0076 1.0025 1.0087 1.0186 0.9990 1.0109 0.9959 0.9961 1.0088 0.9974 0.9964 1.0105 1.0075 0.9990 1.0198 0.9932 1.0117 1.0135 1.0095 1.0034 0.9903 0.9907 0.9901
dispcorr: -0.028019781 hartree
energy: -1079.765243143236
dipole: 12.91876 -13.30098 -0.38222 20.32604 -19.79653 0.52951 -9.82240 8.68990 -1.13251
magnitude: 1.30730 au
magnitude: 3.32290 debye
