program: Orca
programVersion: 5.0.2
elementType: O O O C C C C C C C C C C C C C C C C C C C C C C H H H H H H H H H H H H H H H H H H H H H H H H H H
charge: 0
multiplicity: 1
keywords: wb97x-d3
keywords: def2-TZVPP
keywords: def2/J RIJCOSX
keywords: DEFGRID2
keywords: scfconv7
keywords: smallprint printgap noloewdin
keywords: NOSOSCF
formula: C22H26O3
InChI: InChI=1/C22H26O3/c1-15(2)10-19-20(22(19,3)4)21(23)25-14-17-12-18(24-13-17)11-16-8-6-5-7-9-16/h5-10,12-13,19-20H,11,14H2,1-4H3
51 atoms
O  1.734945 -2.287115 -0.979555
O  2.324209 -1.748354 1.111121
O  -2.589627 -2.446234 -0.458636
C  4.08942 0.438555 -0.281047
C  2.776091 1.032259 0.117329
C  2.810088 -0.258924 -0.699414
C  4.883152 1.057103 -1.408054
C  4.972097 -0.143606 0.795754
C  2.215451 2.252475 -0.489071
C  2.294509 -1.485843 -0.07158
C  1.375335 3.118936 0.089471
C  0.902292 4.33216 -0.653947
C  0.832024 2.998929 1.48077
C  0.939661 -3.3960 -0.518633
C  -0.436238 -2.930927 -0.201225
C  -0.884538 -2.170808 0.930356
C  -1.517847 -3.063081 -1.003349
C  -2.192087 -1.898083 0.719972
C  -3.179578 -1.075991 1.460583
C  -3.537682 0.186352 0.708552
C  -2.541323 1.070811 0.297586
C  -4.861923 0.485622 0.410483
C  -2.863813 2.226459 -0.397682
C  -5.18866 1.644087 -0.285049
C  -4.190891 2.516683 -0.692987
H  2.524989 0.869659 1.159646
H  2.560541 -0.156253 -1.749239
H  4.263519 1.368818 -2.247828
H  5.612329 0.34115 -1.791505
H  5.432911 1.931358 -1.054282
H  4.42034 -0.47979 1.66994
H  5.682545 0.614587 1.130219
H  5.549861 -0.986969 0.412856
H  2.515364 2.45746 -1.512206
H  -0.188914 4.347131 -0.724794
H  1.188989 5.247777 -0.129691
H  1.307202 4.382123 -1.664485
H  1.144313 2.0981 2.003407
H  1.134967 3.856241 2.086468
H  -0.260769 3.00884 1.464262
H  1.417158 -3.889649 0.327179
H  0.922678 -4.097022 -1.350862
H  -0.309259 -1.856521 1.785823
H  -1.665263 -3.554829 -1.952544
H  -2.741184 -0.824904 2.428699
H  -4.085741 -1.651033 1.666614
H  -1.501968 0.852464 0.517489
H  -5.646374 -0.193633 0.72208
H  -2.077695 2.902155 -0.711488
H  -6.224931 1.860187 -0.510848
H  -4.443166 3.416598 -1.238582
elementType: O C H
totalener: -1079.74025809 hartree
nucrepener: 2163.19508267 hartree
electener: -3242.93534076 hartree
oneelecener: -5765.65660627 hartree
twoeener: 2522.72126551 hartree
cpcmener: -0.02979797 hartree
kineticenergy: 1074.85505426 hartree
xcener: -106.462231054283 hartree
chargesum: -0.0000000
charge: -0.293866 -0.507034 -0.286801 0.107378 0.014768 -0.074051 -0.282761 -0.275667 -0.265327 0.422853 -0.059252 -0.216224 -0.264160 0.081487 -0.089185 -0.306432 -0.037037 0.198998 -0.041043 0.020977 -0.218424 -0.190267 -0.135880 -0.138988 -0.208241 0.099237 0.090767 0.092065 0.097031 0.100533 0.090348 0.095584 0.099058 0.119649 0.086395 0.099429 0.089940 0.096609 0.108848 0.084359 0.118073 0.120532 0.164871 0.178672 0.115312 0.104419 0.151550 0.142247 0.181326 0.158994 0.158331
qa: -0.2939 -0.5070 -0.2868 0.1074 0.0148 -0.0741 -0.2828 -0.2757 -0.2653 0.4229 -0.0593 -0.2162 -0.2642 0.0815 -0.0892 -0.3064 -0.0370 0.1990 -0.0410 0.0210 -0.2184 -0.1903 -0.1359 -0.1390 -0.2082 0.0992 0.0908 0.0921 0.0970 0.1005 0.0903 0.0956 0.0991 0.1196 0.0864 0.0994 0.0899 0.0966 0.1088 0.0844 0.1181 0.1205 0.1649 0.1787 0.1153 0.1044 0.1516 0.1422 0.1813 0.1590 0.1583
va: 2.1128 1.9888 2.2651 3.7047 3.7939 3.8058 3.9160 3.8941 3.8737 4.1322 3.7546 3.9167 3.9355 3.8309 3.6907 3.9754 3.9674 3.6481 3.8217 3.6733 3.9391 3.9313 3.8472 3.8753 3.9508 1.0250 1.0354 1.0066 1.0013 1.0000 1.0209 0.9997 0.9992 1.0110 0.9967 0.9963 1.0086 1.0091 0.9999 0.9982 1.0107 0.9979 1.0162 0.9934 1.0048 1.0107 0.9914 1.0029 0.9709 0.9898 0.9929
dispcorr: -0.024758133 hartree
energy: -1079.765016226608
dipole: 15.49700 -15.58965 -0.09265 20.29658 -19.79027 0.50631 0.74239 -1.32250 -0.58011
magnitude: 0.77554 au
magnitude: 1.97126 debye
