program: Orca
programVersion: 5.0.2
elementType: O O O C C C C C C C C C C C C C C C C C C C C C C H H H H H H H H H H H H H H H H H H H H H H H H H H
charge: 0
multiplicity: 1
keywords: wb97x-d3
keywords: def2-TZVPP
keywords: def2/J RIJCOSX
keywords: DEFGRID2
keywords: scfconv7
keywords: smallprint printgap noloewdin
keywords: NOSOSCF
formula: C22H26O3
InChI: InChI=1/C22H26O3/c1-15(2)10-19-20(22(19,3)4)21(23)25-14-17-12-18(24-13-17)11-16-8-6-5-7-9-16/h5-10,12-13,19-20H,11,14H2,1-4H3
51 atoms
O  1.555987 -1.977101 -0.538026
O  0.729916 -0.684508 -2.168097
O  -2.137899 -3.057593 1.405351
C  1.392895 1.468011 0.069777
C  2.280755 1.622409 -1.119482
C  2.139849 0.259152 -0.483358
C  1.864604 1.952882 1.418347
C  -0.101082 1.592288 -0.108682
C  3.580254 2.341529 -1.061915
C  1.404688 -0.815776 -1.173143
C  4.631203 2.070085 -1.839771
C  5.899396 2.862053 -1.751244
C  4.63551 0.974279 -2.860013
C  0.696282 -3.073317 -0.89815
C  -0.606275 -2.932631 -0.19403
C  -1.717114 -2.098623 -0.543053
C  -0.926537 -3.485228 0.999989
C  -2.61259 -2.204955 0.466673
C  -3.895811 -1.503866 0.746293
C  -3.652526 -0.094397 1.236405
C  -3.049953 0.132609 2.472799
C  -3.983855 0.999165 0.443531
C  -2.784642 1.424096 2.903307
C  -3.721054 2.294441 0.873475
C  -3.118559 2.51071 2.103825
H  1.747144 1.71689 -2.062368
H  2.964625 -0.081268 0.133328
H  1.643735 3.014784 1.546682
H  2.93579 1.815669 1.565227
H  1.350992 1.413411 2.216612
H  -0.636777 0.968767 0.610118
H  -0.440599 1.324846 -1.107147
H  -0.403161 2.62682 0.066543
H  3.659551 3.161789 -0.35361
H  5.853977 3.628782 -0.97772
H  6.752612 2.213892 -1.534478
H  6.121893 3.355044 -2.701428
H  4.821588 1.378679 -3.858432
H  5.443259 0.264738 -2.662087
H  3.702666 0.414205 -2.898425
H  1.222519 -3.966099 -0.56422
H  0.577385 -3.136808 -1.979793
H  -1.82947 -1.489434 -1.425307
H  -0.411683 -4.179897 1.645847
H  -4.471487 -2.069037 1.483083
H  -4.494943 -1.475343 -0.165046
H  -2.783963 -0.706408 3.105562
H  -4.452089 0.838728 -0.520644
H  -2.316038 1.583598 3.866315
H  -3.987053 3.133957 0.243599
H  -2.910866 3.518668 2.43974
elementType: O C H
totalener: -1079.75090037 hartree
nucrepener: 2180.90230538 hartree
electener: -3260.65320575 hartree
oneelecener: -5801.32623827 hartree
twoeener: 2540.67303252 hartree
cpcmener: -0.02354500 hartree
kineticenergy: 1074.86874390 hartree
xcener: -106.462342613316 hartree
chargesum: -0.0000000
charge: -0.282615 -0.471617 -0.272582 0.209736 -0.037193 -0.113334 -0.298834 -0.301452 -0.289557 0.396890 -0.015236 -0.229123 -0.239284 0.071509 -0.066448 -0.353169 -0.038582 0.244624 -0.044992 -0.005499 -0.168322 -0.169106 -0.158057 -0.151203 -0.177709 0.103818 0.092503 0.099392 0.094252 0.096265 0.075390 0.099180 0.102422 0.121547 0.089087 0.093765 0.095422 0.099511 0.095833 0.078131 0.116713 0.117527 0.159544 0.174669 0.111021 0.103165 0.136744 0.137995 0.155811 0.155430 0.156017
qa: -0.2826 -0.4716 -0.2726 0.2097 -0.0372 -0.1133 -0.2988 -0.3015 -0.2896 0.3969 -0.0152 -0.2291 -0.2393 0.0715 -0.0664 -0.3532 -0.0386 0.2446 -0.0450 -0.0055 -0.1683 -0.1691 -0.1581 -0.1512 -0.1777 0.1038 0.0925 0.0994 0.0943 0.0963 0.0754 0.0992 0.1024 0.1215 0.0891 0.0938 0.0954 0.0995 0.0958 0.0781 0.1167 0.1175 0.1595 0.1747 0.1110 0.1032 0.1367 0.1380 0.1558 0.1554 0.1560
va: 2.1168 2.0286 2.2800 3.6709 3.8427 3.8237 3.9064 3.8884 3.8858 4.1639 3.7090 3.9299 3.9374 3.8548 3.6814 3.9455 3.9627 3.5839 3.8008 3.6691 3.8944 3.8971 3.8789 3.8666 3.8697 1.0254 1.0326 0.9993 1.0024 1.0030 1.0028 1.0179 1.0010 1.0031 1.0064 0.9969 0.9958 0.9994 0.9991 1.0182 0.9968 1.0099 1.0187 0.9941 1.0132 1.0102 1.0133 1.0040 0.9919 0.9920 0.9919
dispcorr: -0.026765322 hartree
energy: -1079.777665689008
dipole: 18.27077 -17.93765 0.33313 17.73825 -17.76948 -0.03123 -3.35698 4.03425 0.67727
magnitude: 0.75541 au
magnitude: 1.92009 debye
