program: Orca
programVersion: 5.0.2
elementType: O O O C C C C C C C C C C C C C C C C C C C C C C H H H H H H H H H H H H H H H H H H H H H H H H H H
charge: 0
multiplicity: 1
keywords: wb97x-d3
keywords: def2-TZVPP
keywords: def2/J RIJCOSX
keywords: DEFGRID2
keywords: scfconv7
keywords: smallprint printgap noloewdin
keywords: NOSOSCF
formula: C22H26O3
InChI: InChI=1/C22H26O3/c1-15(2)10-19-20(22(19,3)4)21(23)25-14-17-12-18(24-13-17)11-16-8-6-5-7-9-16/h5-10,12-13,19-20H,11,14H2,1-4H3
51 atoms
O  1.545498 -1.991898 -0.484067
O  0.749665 -0.707242 -2.134802
O  -2.18203 -3.152192 1.379811
C  1.369942 1.492282 0.040953
C  2.32339 1.588134 -1.102405
C  2.118998 0.248702 -0.425031
C  1.775723 2.015899 1.397224
C  -0.109641 1.641767 -0.222939
C  3.631038 2.284568 -1.005187
C  1.402253 -0.831983 -1.124246
C  4.646763 2.114605 -1.855458
C  5.921999 2.887858 -1.715444
C  4.604923 1.155551 -3.004945
C  0.699547 -3.092189 -0.864429
C  -0.614172 -2.965679 -0.178623
C  -1.698424 -2.085615 -0.497273
C  -0.973904 -3.586213 0.970219
C  -2.61809 -2.234087 0.485245
C  -3.895223 -1.524796 0.775145
C  -3.640467 -0.114103 1.254643
C  -2.996918 0.114111 2.470018
C  -4.003864 0.978721 0.475188
C  -2.723406 1.405888 2.893687
C  -3.732481 2.274709 0.898171
C  -3.089555 2.492164 2.107484
H  1.842663 1.65238 -2.075076
H  2.902116 -0.085997 0.246391
H  1.594713 3.090842 1.466891
H  2.82721 1.840138 1.624263
H  1.186948 1.5342 2.180642
H  -0.696598 1.046499 0.480126
H  -0.399983 1.35698 -1.232003
H  -0.397819 2.686457 -0.088554
H  3.751663 3.000138 -0.196841
H  6.129345 3.471203 -2.616675
H  5.897343 3.575025 -0.869496
H  6.775251 2.217643 -1.580767
H  3.689871 0.566601 -3.045065
H  4.702921 1.684763 -3.95666
H  5.445889 0.458848 -2.955531
H  1.225638 -3.984615 -0.528957
H  0.597915 -3.148331 -1.948318
H  -1.776788 -1.415972 -1.338493
H  -0.488792 -4.331917 1.58131
H  -4.462891 -2.083432 1.523073
H  -4.50857 -1.498848 -0.127181
H  -2.705016 -0.725141 3.091166
H  -4.503447 0.817214 -0.472945
H  -2.222879 1.566035 3.840402
H  -4.023128 3.11384 0.278747
H  -2.875052 3.500558 2.437675
elementType: O C H
totalener: -1079.75096191 hartree
nucrepener: 2176.96639358 hartree
electener: -3256.71735548 hartree
oneelecener: -5793.42523419 hartree
twoeener: 2536.70787870 hartree
cpcmener: -0.02349233 hartree
kineticenergy: 1074.85836733 hartree
xcener: -106.460646181288 hartree
chargesum: -0.0000000
charge: -0.283597 -0.473261 -0.272960 0.210947 -0.058143 -0.088025 -0.303944 -0.290974 -0.275207 0.391692 -0.014894 -0.229026 -0.245832 0.071973 -0.071367 -0.347785 -0.038674 0.241943 -0.041572 -0.011085 -0.163241 -0.164847 -0.162692 -0.157653 -0.172271 0.102406 0.090625 0.101458 0.092288 0.096414 0.065095 0.100700 0.102439 0.122913 0.093847 0.088615 0.094155 0.079227 0.098994 0.094638 0.116342 0.117910 0.160527 0.174927 0.110214 0.103397 0.137439 0.138290 0.155938 0.155755 0.155944
qa: -0.2836 -0.4733 -0.2730 0.2109 -0.0581 -0.0880 -0.3039 -0.2910 -0.2752 0.3917 -0.0149 -0.2290 -0.2458 0.0720 -0.0714 -0.3478 -0.0387 0.2419 -0.0416 -0.0111 -0.1632 -0.1648 -0.1627 -0.1577 -0.1723 0.1024 0.0906 0.1015 0.0923 0.0964 0.0651 0.1007 0.1024 0.1229 0.0938 0.0886 0.0942 0.0792 0.0990 0.0946 0.1163 0.1179 0.1605 0.1749 0.1102 0.1034 0.1374 0.1383 0.1559 0.1558 0.1559
va: 2.1172 2.0249 2.2806 3.6703 3.8578 3.8212 3.9126 3.8841 3.8829 4.1661 3.7085 3.9290 3.9419 3.8535 3.6932 3.9480 3.9594 3.5969 3.7977 3.6801 3.8876 3.8940 3.8789 3.8745 3.8628 1.0238 1.0337 0.9982 1.0024 1.0029 1.0063 1.0191 1.0016 1.0028 0.9959 1.0069 0.9965 1.0173 0.9987 0.9988 0.9969 1.0102 1.0177 0.9940 1.0135 1.0092 1.0120 1.0038 0.9920 0.9919 0.9918
dispcorr: -0.026512592 hartree
energy: -1079.777474501074
dipole: 18.14251 -17.83494 0.30757 18.46946 -18.45644 0.01302 -3.82924 4.49773 0.66849
magnitude: 0.73596 au
magnitude: 1.87067 debye
