program: Orca
programVersion: 5.0.2
elementType: O O O C C C C C C C C C C C C C C C C C C C C C C H H H H H H H H H H H H H H H H H H H H H H H H H H
charge: 0
multiplicity: 1
keywords: wb97x-d3
keywords: def2-TZVPP
keywords: def2/J RIJCOSX
keywords: DEFGRID2
keywords: scfconv7
keywords: smallprint printgap noloewdin
keywords: NOSOSCF
formula: C22H26O3
InChI: InChI=1/C22H26O3/c1-15(2)10-19-20(22(19,3)4)21(23)25-14-17-12-18(24-13-17)11-16-8-6-5-7-9-16/h5-10,12-13,19-20H,11,14H2,1-4H3
51 atoms
O  0.95243 0.456454 0.111835
O  2.678008 1.094184 1.372338
O  -3.036326 -0.321021 -0.502371
C  4.320129 -0.418591 -0.856778
C  4.375581 1.059072 -1.100885
C  3.033619 0.390183 -0.892936
C  4.542088 -1.353879 -2.020212
C  4.851019 -0.961057 0.446705
C  4.680736 1.630518 -2.43306
C  2.247663 0.686064 0.319225
C  5.768782 2.336296 -2.754786
C  5.948755 2.883723 -4.138665
C  6.886412 2.642735 -1.805742
C  0.047009 0.735145 1.177364
C  -1.323532 0.428357 0.690573
C  -2.544724 0.792031 1.342189
C  -1.686853 -0.24562 -0.424693
C  -3.550755 0.311932 0.572772
C  -5.029433 0.314029 0.731065
C  -5.531197 -0.981038 1.326146
C  -5.703001 -2.113232 0.533515
C  -5.792205 -1.072338 2.690157
C  -6.123433 -3.311389 1.094206
C  -6.214834 -2.268837 3.25318
C  -6.379806 -3.393529 2.456711
H  4.72174 1.636308 -0.249008
H  2.433917 0.243573 -1.784988
H  4.098794 -0.990664 -2.946885
H  4.113643 -2.336447 -1.812853
H  5.611073 -1.490576 -2.197962
H  5.899826 -1.24036 0.325957
H  4.307035 -1.858529 0.749402
H  4.799055 -0.245492 1.264008
H  3.94158 1.455941 -3.209976
H  6.064782 3.970811 -4.1191
H  6.85389 2.485948 -4.605701
H  5.105091 2.649551 -4.787938
H  7.838934 2.296457 -2.215556
H  6.990545 3.721188 -1.659808
H  6.765708 2.183486 -0.826242
H  0.120801 1.78397 1.477425
H  0.292795 0.127605 2.053277
H  -2.65226 1.340474 2.265211
H  -1.134014 -0.700184 -1.231016
H  -5.505629 0.495679 -0.235949
H  -5.300993 1.148054 1.379228
H  -5.510403 -2.059968 -0.531698
H  -5.665011 -0.19837 3.318555
H  -6.252047 -4.183125 0.465095
H  -6.416697 -2.320908 4.315665
H  -6.709178 -4.32737 2.894141
elementType: O C H
totalener: -1079.75391708 hartree
nucrepener: 1986.08892277 hartree
electener: -3065.84283986 hartree
oneelecener: -5411.04831255 hartree
twoeener: 2345.20547269 hartree
cpcmener: -0.02536153 hartree
kineticenergy: 1074.85421034 hartree
xcener: -106.460243575537 hartree
chargesum: 0.0000000
charge: -0.277163 -0.474151 -0.279155 0.137968 0.019732 -0.114487 -0.259652 -0.288785 -0.274251 0.393422 -0.032023 -0.225441 -0.252733 0.110054 -0.025867 -0.352162 -0.072158 0.214732 -0.073259 0.054854 -0.202313 -0.198205 -0.152903 -0.146992 -0.176498 0.093696 0.089360 0.088412 0.097868 0.095499 0.094323 0.099407 0.093590 0.117732 0.093678 0.093509 0.087975 0.094030 0.097487 0.089298 0.107875 0.110095 0.161438 0.171712 0.116096 0.106678 0.138561 0.138741 0.156532 0.156495 0.157349
qa: -0.2772 -0.4742 -0.2792 0.1380 0.0197 -0.1145 -0.2597 -0.2888 -0.2743 0.3934 -0.0320 -0.2254 -0.2527 0.1101 -0.0259 -0.3522 -0.0722 0.2147 -0.0733 0.0549 -0.2023 -0.1982 -0.1529 -0.1470 -0.1765 0.0937 0.0894 0.0884 0.0979 0.0955 0.0943 0.0994 0.0936 0.1177 0.0937 0.0935 0.0880 0.0940 0.0975 0.0893 0.1079 0.1101 0.1614 0.1717 0.1161 0.1067 0.1386 0.1387 0.1565 0.1565 0.1573
va: 2.1384 2.0354 2.2694 3.6734 3.7620 3.9095 3.9056 3.9021 3.8802 4.1535 3.7196 3.9255 3.9447 3.8460 3.7149 4.0147 3.9534 3.6329 3.8213 3.5927 3.9611 3.9454 3.9004 3.8905 3.9061 1.0290 1.0353 1.0038 1.0028 1.0033 1.0008 0.9991 1.0192 1.0088 0.9954 0.9964 1.0086 0.9976 0.9971 1.0080 0.9936 0.9923 1.0066 1.0008 1.0093 1.0104 1.0120 1.0044 0.9910 0.9908 0.9906
dispcorr: -0.021156271 hartree
energy: -1079.775073353371
dipole: 32.20553 -32.28701 -0.08148 3.35789 -3.43805 -0.08015 -11.60235 11.01911 -0.58324
magnitude: 0.59433 au
magnitude: 1.51068 debye
