program: Orca
programVersion: 5.0.2
elementType: O O O C C C C C C C C C C C C C C C C C C C C C C H H H H H H H H H H H H H H H H H H H H H H H H H H
charge: 0
multiplicity: 1
keywords: wb97x-d3
keywords: def2-TZVPP
keywords: def2/J RIJCOSX
keywords: DEFGRID2
keywords: scfconv7
keywords: smallprint printgap noloewdin
keywords: NOSOSCF
formula: C22H26O3
InChI: InChI=1/C22H26O3/c1-15(2)10-19-20(22(19,3)4)21(23)25-14-17-12-18(24-13-17)11-16-8-6-5-7-9-16/h5-10,12-13,19-20H,11,14H2,1-4H3
51 atoms
O  1.710852 -2.089308 -0.190018
O  0.807384 -0.913472 -1.862581
O  -2.151654 -2.740262 1.626377
C  1.85563 1.416493 0.020269
C  2.632597 1.343865 -1.262455
C  2.443507 0.090968 -0.435127
C  2.483405 2.029138 1.248573
C  0.364346 1.646917 -0.049043
C  3.986531 1.913221 -1.407394
C  1.56832 -0.99096 -0.926802
C  4.477701 2.554093 -2.473796
C  5.884888 3.07336 -2.470974
C  3.723169 2.822664 -3.740252
C  0.828072 -3.198129 -0.438334
C  -0.520678 -2.943911 0.13597
C  -1.656869 -2.338006 -0.492491
C  -0.889967 -3.165599 1.419989
C  -2.614376 -2.235453 0.45778
C  -3.958106 -1.602317 0.469982
C  -3.906949 -0.259921 1.161598
C  -3.470506 0.867306 0.4692
C  -4.235513 -0.135567 2.5074
C  -3.365816 2.094208 1.108183
C  -4.131354 1.091683 3.150136
C  -3.693473 2.209237 2.453507
H  2.011803 1.379531 -2.151129
H  3.296652 -0.247215 0.143495
H  1.968363 1.685477 2.147956
H  2.403854 3.118048 1.219614
H  3.536855 1.776798 1.362941
H  -0.081855 1.317199 -0.985297
H  0.151337 2.713136 0.05357
H  -0.147187 1.132482 0.767422
H  4.649494 1.784215 -0.556637
H  6.472258 2.62279 -3.275921
H  5.907313 4.153168 -2.642123
H  6.397958 2.873123 -1.530079
H  4.257597 2.40766 -4.599981
H  2.714142 2.41325 -3.74949
H  3.644741 3.899409 -3.917976
H  1.307869 -4.041037 0.056548
H  0.77884 -3.418911 -1.505266
H  -1.742805 -2.015997 -1.517649
H  -0.37802 -3.605007 2.262653
H  -4.685589 -2.254334 0.959967
H  -4.283592 -1.48118 -0.564303
H  -3.205573 0.783022 -0.57889
H  -4.578061 -1.003518 3.058774
H  -3.027017 2.961457 0.555353
H  -4.390933 1.173376 4.19814
H  -3.612567 3.165799 2.953859
elementType: O C H
totalener: -1079.75403494 hartree
nucrepener: 2136.26723706 hartree
electener: -3216.02127200 hartree
oneelecener: -5712.07621556 hartree
twoeener: 2496.05494356 hartree
cpcmener: -0.02516316 hartree
kineticenergy: 1074.85953744 hartree
xcener: -106.460673689487 hartree
chargesum: -0.0000000
charge: -0.279960 -0.469929 -0.274621 0.120117 0.028250 -0.082698 -0.277490 -0.294195 -0.271986 0.397118 -0.054286 -0.218868 -0.251693 0.068053 -0.068393 -0.328182 -0.037111 0.210157 -0.058244 0.088252 -0.238240 -0.203614 -0.157006 -0.150530 -0.166560 0.091840 0.089599 0.097813 0.097960 0.089244 0.092195 0.099002 0.098457 0.116033 0.093099 0.092245 0.087520 0.094044 0.090414 0.095831 0.119561 0.119551 0.155091 0.173297 0.111140 0.112506 0.143487 0.139727 0.158749 0.156120 0.157136
qa: -0.2800 -0.4699 -0.2746 0.1201 0.0282 -0.0827 -0.2775 -0.2942 -0.2720 0.3971 -0.0543 -0.2189 -0.2517 0.0681 -0.0684 -0.3282 -0.0371 0.2102 -0.0582 0.0883 -0.2382 -0.2036 -0.1570 -0.1505 -0.1666 0.0918 0.0896 0.0978 0.0980 0.0892 0.0922 0.0990 0.0985 0.1160 0.0931 0.0922 0.0875 0.0940 0.0904 0.0958 0.1196 0.1196 0.1551 0.1733 0.1111 0.1125 0.1435 0.1397 0.1587 0.1561 0.1571
va: 2.1245 2.0388 2.2773 3.7064 3.7887 3.7978 3.9047 3.9059 3.8767 4.2057 3.7728 3.9211 3.9390 3.8541 3.6336 3.9871 3.9678 3.6234 3.8222 3.5346 3.9233 3.9680 3.8684 3.8960 3.8985 1.0306 1.0343 1.0014 1.0014 1.0070 1.0170 1.0014 0.9937 1.0117 0.9963 0.9959 1.0090 0.9969 1.0110 0.9968 0.9966 1.0058 1.0208 0.9943 1.0099 1.0091 1.0032 1.0065 0.9899 0.9907 0.9902
dispcorr: -0.024342695 hartree
energy: -1079.778377630965
dipole: 18.24505 -17.87234 0.37271 21.25767 -21.15430 0.10336 -7.07948 7.57862 0.49914
magnitude: 0.63146 au
magnitude: 1.60504 debye
