program: Orca
programVersion: 5.0.2
elementType: O O O C C C C C C C C C C C C C C C C C C C C C C H H H H H H H H H H H H H H H H H H H H H H H H H H
charge: 0
multiplicity: 1
keywords: wb97x-d3
keywords: def2-TZVPP
keywords: def2/J RIJCOSX
keywords: DEFGRID2
keywords: scfconv7
keywords: smallprint printgap noloewdin
keywords: NOSOSCF
formula: C22H26O3
InChI: InChI=1/C22H26O3/c1-15(2)10-19-20(22(19,3)4)21(23)25-14-17-12-18(24-13-17)11-16-8-6-5-7-9-16/h5-10,12-13,19-20H,11,14H2,1-4H3
51 atoms
O  1.493941 -2.300547 -0.933264
O  2.119843 -1.568149 1.083608
O  -2.134393 -2.380758 1.545583
C  3.846399 0.439687 -0.621985
C  2.601467 1.114266 -0.132653
C  2.49403 -0.213155 -0.853147
C  4.527614 0.980156 -1.855218
C  4.813602 -0.123083 0.390081
C  2.033721 2.325786 -0.772064
C  2.039839 -1.404422 -0.111323
C  2.05014 3.556652 -0.252248
C  1.407001 4.707861 -0.964157
C  2.693526 3.90218 1.055311
C  0.818916 -3.426296 -0.345521
C  -0.511679 -3.016652 0.174896
C  -1.666909 -2.666102 -0.597211
C  -0.860728 -2.815803 1.466822
C  -2.619714 -2.284146 0.2844
C  -3.985304 -1.720448 0.11711
C  -3.960913 -0.211226 0.194366
C  -3.834574 0.547877 -0.965651
C  -4.007415 0.443039 1.422305
C  -3.754388 1.931984 -0.902679
C  -3.924437 1.827408 1.488529
C  -3.795977 2.576325 0.326447
H  2.459123 1.045494 0.941739
H  2.14354 -0.16441 -1.878785
H  5.151516 0.21309 -2.318668
H  5.175538 1.820379 -1.595911
H  3.821411 1.329797 -2.608172
H  5.332546 -0.998884 -0.005851
H  4.338923 -0.409111 1.325977
H  5.571757 0.626647 0.62511
H  1.554435 2.186412 -1.737046
H  2.13573 5.492946 -1.183495
H  0.94357 4.406353 -1.90367
H  0.634995 5.170058 -0.34276
H  3.182148 3.056458 1.536172
H  3.447888 4.681128 0.915651
H  1.960008 4.308922 1.75671
H  1.430512 -3.887923 0.430689
H  0.718632 -4.140383 -1.161767
H  -1.766703 -2.69048 -1.67148
H  -0.334576 -2.947182 2.399613
H  -4.657274 -2.12954 0.87574
H  -4.369931 -2.037015 -0.853206
H  -3.798289 0.05207 -1.928991
H  -4.111114 -0.131448 2.335448
H  -3.66004 2.507063 -1.815187
H  -3.960771 2.322958 2.450484
H  -3.731698 3.655734 0.377721
elementType: O C H
totalener: -1079.75355764 hartree
nucrepener: 2127.65206821 hartree
electener: -3207.40562585 hartree
oneelecener: -5695.01259137 hartree
twoeener: 2487.60696551 hartree
cpcmener: -0.02573469 hartree
kineticenergy: 1074.86049299 hartree
xcener: -106.459147020746 hartree
chargesum: -0.0000000
charge: -0.288126 -0.474939 -0.276675 0.151024 -0.001155 -0.127473 -0.262002 -0.293631 -0.269166 0.406820 -0.028955 -0.229703 -0.252772 0.095407 -0.080401 -0.346093 -0.015095 0.217761 -0.068627 0.062322 -0.202733 -0.204450 -0.147664 -0.149442 -0.178003 0.096726 0.086630 0.097816 0.094879 0.088557 0.099487 0.093648 0.093740 0.118720 0.093749 0.089022 0.093822 0.088061 0.095170 0.097293 0.115688 0.120602 0.159532 0.170794 0.113891 0.107593 0.139430 0.139254 0.156440 0.156010 0.157215
qa: -0.2881 -0.4749 -0.2767 0.1510 -0.0012 -0.1275 -0.2620 -0.2936 -0.2692 0.4068 -0.0290 -0.2297 -0.2528 0.0954 -0.0804 -0.3461 -0.0151 0.2178 -0.0686 0.0623 -0.2027 -0.2045 -0.1477 -0.1494 -0.1780 0.0967 0.0866 0.0978 0.0949 0.0886 0.0995 0.0936 0.0937 0.1187 0.0937 0.0890 0.0938 0.0881 0.0952 0.0973 0.1157 0.1206 0.1595 0.1708 0.1139 0.1076 0.1394 0.1393 0.1564 0.1560 0.1572
va: 2.1197 2.0303 2.2793 3.6659 3.7694 3.9035 3.9056 3.8982 3.8756 4.1716 3.7083 3.9271 3.9449 3.8232 3.6373 4.0104 3.9543 3.6072 3.8285 3.5834 3.9476 3.9655 3.8917 3.8984 3.9058 1.0276 1.0396 1.0027 1.0033 1.0032 0.9991 1.0197 1.0009 1.0085 0.9965 1.0082 0.9956 1.0083 0.9977 0.9978 1.0112 0.9924 1.0085 1.0016 1.0107 1.0105 1.0042 1.0100 0.9908 0.9910 0.9908
dispcorr: -0.022740097 hartree
energy: -1079.776297738204
dipole: 18.40333 -18.51469 -0.11136 21.71176 -21.39723 0.31453 -5.02976 4.00068 -1.02908
magnitude: 1.08182 au
magnitude: 2.74977 debye
