program: Orca
programVersion: 5.0.2
elementType: O O O C C C C C C C C C C C C C C C C C C C C C C H H H H H H H H H H H H H H H H H H H H H H H H H H
charge: 0
multiplicity: 1
keywords: wb97x-d3
keywords: def2-TZVPP
keywords: def2/J RIJCOSX
keywords: DEFGRID2
keywords: scfconv7
keywords: smallprint printgap noloewdin
keywords: NOSOSCF
formula: C22H26O3
InChI: InChI=1/C22H26O3/c1-15(2)10-19-20(22(19,3)4)21(23)25-14-17-12-18(24-13-17)11-16-8-6-5-7-9-16/h5-10,12-13,19-20H,11,14H2,1-4H3
51 atoms
O  1.744352 -2.329337 -0.84521
O  2.099967 -1.553636 1.221622
O  -2.552104 -2.526461 -0.559697
C  3.972034 0.497151 -0.262986
C  2.637269 1.118527 0.00984
C  2.711607 -0.236102 -0.681273
C  4.823905 1.023414 -1.393514
C  4.789706 0.015827 0.910549
C  2.1013 2.273716 -0.734786
C  2.176098 -1.416195 0.022476
C  1.447239 3.318352 -0.214601
C  0.919118 4.409259 -1.097927
C  1.16155 3.510184 1.244559
C  0.976974 -3.441035 -0.348026
C  -0.433905 -3.026277 -0.1269
C  -1.000192 -2.360802 1.009053
C  -1.43097 -3.096905 -1.040429
C  -2.282812 -2.073717 0.688561
C  -3.341482 -1.297099 1.3792
C  -3.533917 0.069623 0.758046
C  -2.451149 0.934425 0.605574
C  -4.788681 0.488049 0.330514
C  -2.620944 2.185853 0.033705
C  -4.96247 1.743627 -0.240361
C  -3.878627 2.595217 -0.392604
H  2.333577 1.052276 1.048798
H  2.520894 -0.231673 -1.748763
H  5.378185 1.90881 -1.075508
H  4.243885 1.294762 -2.274735
H  5.552398 0.271247 -1.702646
H  5.467281 0.809371 1.231827
H  5.402336 -0.845441 0.635878
H  4.185152 -0.262629 1.770342
H  2.236643 2.252452 -1.812383
H  1.377099 5.371309 -0.852339
H  1.099336 4.211118 -2.154464
H  -0.158166 4.538557 -0.959397
H  1.687965 2.812927 1.894579
H  1.435948 4.520982 1.55797
H  0.090586 3.406996 1.44622
H  1.431056 -3.855521 0.551911
H  1.039363 -4.192724 -1.132979
H  -0.511881 -2.116799 1.938584
H  -1.481298 -3.512312 -2.035466
H  -3.049665 -1.192597 2.426617
H  -4.288543 -1.842351 1.371603
H  -1.463141 0.625783 0.92894
H  -5.63991 -0.173776 0.441019
H  -1.768002 2.843491 -0.082762
H  -5.946782 2.052261 -0.569282
H  -4.01037 3.571673 -0.841077
elementType: O C H
totalener: -1079.75290382 hartree
nucrepener: 2162.77659154 hartree
electener: -3242.52949536 hartree
oneelecener: -5764.79176551 hartree
twoeener: 2522.26227015 hartree
cpcmener: -0.02493782 hartree
kineticenergy: 1074.86086621 hartree
xcener: -106.461300675878 hartree
chargesum: -0.0000000
charge: -0.285244 -0.479741 -0.275369 0.098933 0.040586 -0.079138 -0.270390 -0.273646 -0.264675 0.400029 -0.068714 -0.213507 -0.253770 0.075906 -0.088501 -0.299480 -0.037788 0.200619 -0.050418 0.037110 -0.219811 -0.199946 -0.101324 -0.123473 -0.216200 0.090834 0.085872 0.097657 0.087452 0.096899 0.093980 0.096990 0.091963 0.115105 0.098090 0.088525 0.088804 0.096055 0.098369 0.090668 0.116395 0.119083 0.162162 0.173665 0.113776 0.102354 0.145975 0.138927 0.150056 0.155183 0.153114
qa: -0.2852 -0.4797 -0.2754 0.0989 0.0406 -0.0791 -0.2704 -0.2736 -0.2647 0.4000 -0.0687 -0.2135 -0.2538 0.0759 -0.0885 -0.2995 -0.0378 0.2006 -0.0504 0.0371 -0.2198 -0.1999 -0.1013 -0.1235 -0.2162 0.0908 0.0859 0.0977 0.0875 0.0969 0.0940 0.0970 0.0920 0.1151 0.0981 0.0885 0.0888 0.0961 0.0984 0.0907 0.1164 0.1191 0.1622 0.1737 0.1138 0.1024 0.1460 0.1389 0.1501 0.1552 0.1531
va: 2.1206 2.0207 2.2777 3.7088 3.7594 3.8375 3.9129 3.8973 3.8721 4.1597 3.7617 3.9160 3.9354 3.8457 3.6791 3.9697 3.9715 3.6327 3.8314 3.6635 3.9557 3.9486 3.8399 3.8734 3.9672 1.0343 1.0373 1.0013 1.0064 1.0017 1.0001 0.9999 1.0209 1.0126 0.9965 1.0090 0.9944 1.0078 0.9995 0.9967 1.0097 0.9968 1.0168 0.9950 1.0042 1.0127 1.0027 1.0039 0.9872 0.9907 0.9944
dispcorr: -0.024586751 hartree
energy: -1079.777490575425
dipole: 15.98891 -15.98192 0.00699 21.21420 -20.88068 0.33352 -0.18660 -0.38050 -0.56711
magnitude: 0.65795 au
magnitude: 1.67237 debye
