program: Orca
programVersion: 5.0.2
elementType: O O O C C C C C C C C C C C C C C C C C C C C C C H H H H H H H H H H H H H H H H H H H H H H H H H H
charge: 0
multiplicity: 1
keywords: wb97x-d3
keywords: def2-TZVPP
keywords: def2/J RIJCOSX
keywords: DEFGRID2
keywords: scfconv7
keywords: smallprint printgap noloewdin
keywords: NOSOSCF
formula: C22H26O3
InChI: InChI=1/C22H26O3/c1-15(2)10-19-20(22(19,3)4)21(23)25-14-17-12-18(24-13-17)11-16-8-6-5-7-9-16/h5-10,12-13,19-20H,11,14H2,1-4H3
51 atoms
O  1.496127 -1.69517 0.609262
O  1.592201 -1.265486 -1.584121
O  -2.84952 -2.393402 1.136996
C  2.214177 1.623224 -0.523896
C  3.467371 0.972377 -1.026182
C  2.597091 0.240378 -0.021719
C  2.304933 2.740391 0.487574
C  1.060557 1.800182 -1.4813
C  4.81278 1.424145 -0.625018
C  1.852948 -0.96151 -0.442993
C  5.890189 1.525612 -1.411008
C  7.196444 2.012319 -0.858365
C  5.924787 1.193654 -2.871606
C  0.695832 -2.868604 0.388978
C  -0.752239 -2.534037 0.423355
C  -1.519079 -1.770998 -0.519465
C  -1.619738 -2.876787 1.403574
C  -2.780871 -1.716703 -0.033735
C  -4.021441 -1.054715 -0.511822
C  -4.50724 -0.005019 0.458527
C  -5.61468 -0.239415 1.265366
C  -3.829108 1.205755 0.582127
C  -6.041803 0.717186 2.177952
C  -4.253642 2.163335 1.49076
C  -5.362274 1.920917 2.293237
H  3.383617 0.586775 -2.036243
H  2.956536 0.213983 1.001141
H  2.568416 3.679932 -0.003223
H  3.04116 2.555719 1.26885
H  1.340589 2.885877 0.978737
H  1.065488 1.083448 -2.299325
H  1.104098 2.797493 -1.923826
H  0.102256 1.714646 -0.96315
H  4.930445 1.700143 0.418855
H  7.971548 1.246476 -0.950584
H  7.557694 2.883335 -1.411955
H  7.12379 2.290108 0.193276
H  6.118025 2.091613 -3.463507
H  6.742807 0.502879 -3.087831
H  5.007777 0.745089 -3.246147
H  0.946712 -3.544561 1.205707
H  0.979694 -3.354519 -0.54507
H  -1.176637 -1.320565 -1.437265
H  -1.505047 -3.446945 2.312882
H  -4.806804 -1.79754 -0.677908
H  -3.804996 -0.60484 -1.48243
H  -6.15113 -1.177168 1.179081
H  -2.960745 1.399913 -0.037853
H  -6.906392 0.519838 2.799064
H  -3.718795 3.101181 1.573145
H  -5.693938 2.66805 3.002986
elementType: O C H
totalener: -1079.75528434 hartree
nucrepener: 2076.13321970 hartree
electener: -3155.88850405 hartree
oneelecener: -5591.41840418 hartree
twoeener: 2435.52990013 hartree
cpcmener: -0.02529152 hartree
kineticenergy: 1074.86365107 hartree
xcener: -106.462031639485 hartree
chargesum: -0.0000000
charge: -0.281889 -0.478071 -0.278872 0.108901 0.033308 -0.089356 -0.276398 -0.283126 -0.273396 0.408576 -0.050337 -0.217614 -0.252153 0.072573 -0.083565 -0.307506 -0.036948 0.192613 -0.059967 0.037474 -0.176058 -0.192355 -0.160231 -0.166005 -0.164364 0.094399 0.088900 0.097767 0.088935 0.096702 0.093505 0.097931 0.095690 0.114779 0.093776 0.091670 0.087230 0.097388 0.092650 0.090227 0.114973 0.119459 0.162420 0.174064 0.107562 0.117643 0.138107 0.150447 0.156043 0.155710 0.156790
qa: -0.2819 -0.4781 -0.2789 0.1089 0.0333 -0.0894 -0.2764 -0.2831 -0.2734 0.4086 -0.0503 -0.2176 -0.2522 0.0726 -0.0836 -0.3075 -0.0369 0.1926 -0.0600 0.0375 -0.1761 -0.1924 -0.1602 -0.1660 -0.1644 0.0944 0.0889 0.0978 0.0889 0.0967 0.0935 0.0979 0.0957 0.1148 0.0938 0.0917 0.0872 0.0974 0.0927 0.0902 0.1150 0.1195 0.1624 0.1741 0.1076 0.1176 0.1381 0.1504 0.1560 0.1557 0.1568
va: 2.1233 2.0253 2.2796 3.6747 3.7815 3.8293 3.9105 3.9069 3.8778 4.1682 3.7703 3.9208 3.9400 3.8490 3.6938 3.9943 3.9708 3.6685 3.8145 3.5909 3.9460 3.9318 3.9008 3.9171 3.8971 1.0284 1.0349 1.0011 1.0072 1.0013 1.0179 1.0011 0.9987 1.0123 0.9963 0.9959 1.0091 0.9966 0.9973 1.0114 0.9984 1.0094 1.0162 0.9946 1.0059 1.0063 1.0045 0.9973 0.9912 0.9920 0.9905
dispcorr: -0.022460481 hartree
energy: -1079.777744823577
dipole: 24.39665 -24.17387 0.22279 18.13209 -17.72975 0.40234 -7.34890 7.83649 0.48759
magnitude: 0.67026 au
magnitude: 1.70367 debye
