program: Orca
programVersion: 5.0.2
elementType: O O O C C C C C C C C C C C C C C C C C C C C C C H H H H H H H H H H H H H H H H H H H H H H H H H H
charge: 0
multiplicity: 1
keywords: wb97x-d3
keywords: def2-TZVPP
keywords: def2/J RIJCOSX
keywords: DEFGRID2
keywords: scfconv7
keywords: smallprint printgap noloewdin
keywords: NOSOSCF
formula: C22H26O3
InChI: InChI=1/C22H26O3/c1-15(2)10-19-20(22(19,3)4)21(23)25-14-17-12-18(24-13-17)11-16-8-6-5-7-9-16/h5-10,12-13,19-20H,11,14H2,1-4H3
51 atoms
O  1.712619 -2.131942 0.0717
O  1.21403 -1.177137 -1.889138
O  -2.381963 -2.720647 1.395813
C  1.765332 1.323829 0.019651
C  2.74838 1.236186 -1.115147
C  2.492798 0.018769 -0.258629
C  2.140167 2.037639 1.295886
C  0.297202 1.451631 -0.309744
C  4.0736 1.883732 -1.069919
C  1.749262 -1.133272 -0.805621
C  4.679183 2.541839 -2.064206
C  6.041012 3.139076 -1.866929
C  4.104489 2.754634 -3.431624
C  0.857576 -3.255718 -0.204904
C  -0.547644 -2.940996 0.166952
C  -1.531163 -2.215535 -0.583426
C  -1.130464 -3.217546 1.357342
C  -2.620649 -2.10763 0.212132
C  -3.916612 -1.397447 0.057285
C  -3.924746 -0.106425 0.842868
C  -4.361947 -0.075249 2.163625
C  -3.441371 1.06618 0.268268
C  -4.31634 1.104194 2.895779
C  -3.397374 2.246852 0.996364
C  -3.833935 2.268716 2.314569
H  2.281166 1.191519 -2.092855
H  3.251543 -0.239979 0.472402
H  1.508133 1.698302 2.119034
H  1.992812 3.114781 1.191329
H  3.17516 1.871675 1.592424
H  -0.315834 0.972338 0.456698
H  0.032674 1.01884 -1.272749
H  0.015585 2.506444 -0.340039
H  4.609167 1.800627 -0.128367
H  6.026624 4.21847 -2.041627
H  6.425939 2.96729 -0.861634
H  6.760162 2.723037 -2.577959
H  4.042178 3.822355 -3.65871
H  4.755485 2.317911 -4.193858
H  3.110158 2.333717 -3.567381
H  1.24714 -4.060874 0.416357
H  0.946978 -3.563083 -1.247182
H  -1.437422 -1.823615 -1.583181
H  -0.786705 -3.744854 2.234239
H  -4.742397 -2.039209 0.375068
H  -4.063965 -1.191176 -1.003736
H  -4.744152 -0.978298 2.625334
H  -3.095733 1.056192 -0.759354
H  -4.660414 1.113041 3.922421
H  -3.02101 3.150386 0.533113
H  -3.800365 3.188438 2.884628
elementType: O C H
totalener: -1079.75414482 hartree
nucrepener: 2138.84865791 hartree
electener: -3218.60280272 hartree
oneelecener: -5717.06917097 hartree
twoeener: 2498.46636824 hartree
cpcmener: -0.02502472 hartree
kineticenergy: 1074.85954649 hartree
xcener: -106.461087293550 hartree
chargesum: -0.0000000
charge: -0.278100 -0.468348 -0.276680 0.127252 0.026820 -0.089676 -0.275938 -0.300927 -0.271218 0.397081 -0.055120 -0.218519 -0.251443 0.066862 -0.056531 -0.357373 -0.036651 0.223679 -0.052822 0.105574 -0.205987 -0.270008 -0.149417 -0.136928 -0.174807 0.091007 0.090850 0.098000 0.097472 0.089161 0.099976 0.093659 0.102479 0.114913 0.092255 0.088005 0.092697 0.094551 0.095503 0.089723 0.117625 0.119251 0.158484 0.173463 0.113924 0.109911 0.138783 0.145894 0.156087 0.158235 0.157319
qa: -0.2781 -0.4683 -0.2767 0.1273 0.0268 -0.0897 -0.2759 -0.3009 -0.2712 0.3971 -0.0551 -0.2185 -0.2514 0.0669 -0.0565 -0.3574 -0.0367 0.2237 -0.0528 0.1056 -0.2060 -0.2700 -0.1494 -0.1369 -0.1748 0.0910 0.0908 0.0980 0.0975 0.0892 0.1000 0.0937 0.1025 0.1149 0.0923 0.0880 0.0927 0.0946 0.0955 0.0897 0.1176 0.1193 0.1585 0.1735 0.1139 0.1099 0.1388 0.1459 0.1561 0.1582 0.1573
va: 2.1223 2.0392 2.2794 3.6946 3.7919 3.8057 3.9009 3.9083 3.8752 4.2134 3.7731 3.9204 3.9400 3.8540 3.6482 3.9811 3.9716 3.6127 3.8143 3.5128 3.9725 3.9326 3.8948 3.8584 3.9111 1.0326 1.0343 1.0020 1.0016 1.0068 0.9916 1.0165 1.0017 1.0121 0.9963 1.0090 0.9962 0.9973 0.9967 1.0111 0.9970 1.0077 1.0201 0.9944 1.0086 1.0100 1.0084 1.0010 0.9908 0.9898 0.9902
dispcorr: -0.024739485 hartree
energy: -1079.778884302689
dipole: 18.06321 -17.90910 0.15411 21.40342 -21.18034 0.22308 -5.91275 6.53734 0.62459
magnitude: 0.68090 au
magnitude: 1.73071 debye
