program: Orca
programVersion: 5.0.2
elementType: O O O C C C C C C C C C C C C C C C C C C C C C C H H H H H H H H H H H H H H H H H H H H H H H H H H
charge: 0
multiplicity: 1
keywords: wb97x-d3
keywords: def2-TZVPP
keywords: def2/J RIJCOSX
keywords: DEFGRID2
keywords: scfconv7
keywords: smallprint printgap noloewdin
keywords: NOSOSCF
formula: C22H26O3
InChI: InChI=1/C22H26O3/c1-15(2)10-19-20(22(19,3)4)21(23)25-14-17-12-18(24-13-17)11-16-8-6-5-7-9-16/h5-10,12-13,19-20H,11,14H2,1-4H3
51 atoms
O  1.205109 -1.860161 -1.385056
O  0.31318 0.18316 -1.562449
O  -1.734474 -3.393254 1.441927
C  2.75983 0.829603 0.324695
C  3.024785 1.351204 -1.057632
C  2.592724 -0.084496 -0.879547
C  3.926776 0.518095 1.228962
C  1.552674 1.340431 1.073147
C  4.396544 1.623083 -1.54532
C  1.255593 -0.532147 -1.313638
C  4.897651 2.819209 -1.867524
C  6.306828 2.953935 -2.361578
C  4.142406 4.108433 -1.764537
C  -0.056338 -2.487568 -1.67394
C  -0.894117 -2.596854 -0.449958
C  -1.814135 -1.639813 0.092934
C  -0.893689 -3.635949 0.416996
C  -2.293355 -2.175758 1.240433
C  -3.249924 -1.696739 2.275475
C  -3.929455 -0.425312 1.848022
C  -5.155307 -0.465809 1.190482
C  -3.328168 0.810128 2.07144
C  -5.772764 0.704071 0.769504
C  -3.940893 1.98188 1.648686
C  -5.166323 1.931844 0.997488
H  2.248596 2.008629 -1.436578
H  3.369747 -0.834634 -0.984311
H  4.277467 1.424461 1.727475
H  4.773272 0.08709 0.695349
H  3.631091 -0.19093 2.004957
H  1.134608 0.568649 1.723583
H  0.757728 1.695526 0.420653
H  1.846328 2.178256 1.709117
H  5.048186 0.759414 -1.645112
H  6.333946 3.406577 -3.356473
H  6.890763 3.609437 -1.709654
H  6.818763 1.993094 -2.416598
H  4.64433 4.788331 -1.070545
H  4.114615 4.621847 -2.729306
H  3.11657 3.989848 -1.419862
H  0.209005 -3.476298 -2.045165
H  -0.575545 -1.958069 -2.473384
H  -2.082171 -0.684686 -0.328623
H  -0.370244 -4.580013 0.426683
H  -2.717639 -1.537627 3.218992
H  -3.995467 -2.472607 2.471534
H  -5.633419 -1.421641 1.009577
H  -2.37263 0.85713 2.581327
H  -6.728772 0.655617 0.263643
H  -3.461932 2.935604 1.831065
H  -5.646548 2.845022 0.669683
elementType: O C H
totalener: -1079.75411309 hartree
nucrepener: 2094.49721919 hartree
electener: -3174.25133228 hartree
oneelecener: -5628.43228400 hartree
twoeener: 2454.18095172 hartree
cpcmener: -0.02481968 hartree
kineticenergy: 1074.85596102 hartree
xcener: -106.459916279436 hartree
chargesum: -0.0000000
charge: -0.281299 -0.473326 -0.277740 0.140791 0.018014 -0.126497 -0.262185 -0.294120 -0.274719 0.411925 -0.037233 -0.223672 -0.251677 0.068343 -0.100148 -0.279925 -0.036867 0.178029 0.001833 0.005578 -0.192575 -0.198082 -0.150906 -0.152229 -0.166618 0.094417 0.087639 0.095595 0.087761 0.097131 0.099843 0.092703 0.096812 0.117722 0.093603 0.092559 0.087930 0.096011 0.095583 0.088906 0.118361 0.118217 0.158415 0.174646 0.106460 0.103832 0.138852 0.141288 0.156368 0.156984 0.157666
qa: -0.2813 -0.4733 -0.2777 0.1408 0.0180 -0.1265 -0.2622 -0.2941 -0.2747 0.4119 -0.0372 -0.2237 -0.2517 0.0683 -0.1001 -0.2799 -0.0369 0.1780 0.0018 0.0056 -0.1926 -0.1981 -0.1509 -0.1522 -0.1666 0.0944 0.0876 0.0956 0.0878 0.0971 0.0998 0.0927 0.0968 0.1177 0.0936 0.0926 0.0879 0.0960 0.0956 0.0889 0.1184 0.1182 0.1584 0.1746 0.1065 0.1038 0.1389 0.1413 0.1564 0.1570 0.1577
va: 2.1243 2.0349 2.2772 3.6729 3.7707 3.8853 3.9014 3.9051 3.8719 4.1703 3.7294 3.9245 3.9440 3.8562 3.7014 3.9374 3.9719 3.6958 3.8186 3.6223 3.9430 3.9248 3.8962 3.8968 3.8976 1.0288 1.0392 1.0030 1.0042 1.0026 0.9987 1.0188 1.0022 1.0087 0.9960 0.9962 1.0086 0.9971 0.9975 1.0090 0.9968 1.0070 1.0148 0.9944 1.0035 1.0091 1.0044 1.0043 0.9909 0.9910 0.9902
dispcorr: -0.023055323 hartree
energy: -1079.777168413950
dipole: 23.84828 -23.21273 0.63555 19.65042 -19.88653 -0.23611 -0.99293 1.40236 0.40943
magnitude: 0.79202 au
magnitude: 2.01317 debye
