program: Orca
programVersion: 5.0.2
elementType: O O O C C C C C C C C C C C C C C C C C C C C C C H H H H H H H H H H H H H H H H H H H H H H H H H H
charge: 0
multiplicity: 1
keywords: wb97x-d3
keywords: def2-TZVPP
keywords: def2/J RIJCOSX
keywords: DEFGRID2
keywords: scfconv7
keywords: smallprint printgap noloewdin
keywords: NOSOSCF
formula: C22H26O3
InChI: InChI=1/C22H26O3/c1-15(2)10-19-20(22(19,3)4)21(23)25-14-17-12-18(24-13-17)11-16-8-6-5-7-9-16/h5-10,12-13,19-20H,11,14H2,1-4H3
51 atoms
O  0.974462 -0.826123 -1.566903
O  0.992445 1.173577 -0.566271
O  -1.225546 -2.061745 1.780002
C  3.891042 0.235446 0.24263
C  3.957447 1.243533 -0.852413
C  3.050641 0.033697 -1.010873
C  5.024562 -0.747173 0.41577
C  3.23914 0.616847 1.549313
C  5.147259 1.413859 -1.723138
C  1.589432 0.218246 -1.002573
C  5.146527 2.048637 -2.898906
C  6.404885 2.221871 -3.692284
C  3.917159 2.635385 -3.520367
C  -0.450845 -0.829216 -1.586938
C  -1.01189 -1.243498 -0.270377
C  -2.373852 -1.108447 0.148696
C  -0.364515 -1.832738 0.76041
C  -2.444166 -1.621381 1.401224
C  -3.560508 -1.79323 2.371751
C  -4.713811 -0.873131 2.072803
C  -4.574587 0.50284 2.248935
C  -5.928639 -1.368536 1.61364
C  -5.626454 1.361911 1.972171
C  -6.986458 -0.509935 1.336283
C  -6.838181 0.857119 1.51451
H  3.408115 2.158583 -0.646907
H  3.402052 -0.751259 -1.671189
H  5.445279 -1.081459 -0.532729
H  4.68047 -1.634864 0.950541
H  5.833344 -0.305143 1.002332
H  2.761708 -0.246585 2.018999
H  2.490344 1.399809 1.445724
H  3.99993 0.985997 2.241349
H  6.088962 1.015226 -1.356683
H  6.311028 1.770488 -4.683718
H  6.622454 3.28087 -3.85645
H  7.26854 1.775045 -3.199368
H  4.031547 3.71326 -3.66651
H  3.748756 2.208833 -4.513272
H  3.014053 2.472194 -2.933504
H  -0.723093 -1.543306 -2.366729
H  -0.844713 0.144075 -1.889947
H  -3.185001 -0.67492 -0.415436
H  0.660594 -2.12907 0.921039
H  -3.186826 -1.605661 3.382907
H  -3.903717 -2.832504 2.363653
H  -3.632872 0.904844 2.605141
H  -6.052755 -2.435828 1.471542
H  -5.502075 2.427878 2.115731
H  -7.926501 -0.912576 0.980827
H  -7.660465 1.527677 1.299941
elementType: O C H
totalener: -1079.75240208 hartree
nucrepener: 2053.12376807 hartree
electener: -3132.87617015 hartree
oneelecener: -5545.42843204 hartree
twoeener: 2412.55226190 hartree
cpcmener: -0.02508286 hartree
kineticenergy: 1074.83760615 hartree
xcener: -106.459278909368 hartree
chargesum: 0.0000000
charge: -0.292894 -0.468617 -0.283643 0.155876 -0.053389 -0.066489 -0.294709 -0.271988 -0.270380 0.357115 -0.014244 -0.228683 -0.246429 0.110463 -0.047036 -0.327839 -0.058374 0.196316 -0.020325 0.001554 -0.209214 -0.173153 -0.142083 -0.152538 -0.171362 0.101305 0.091652 0.090215 0.098127 0.101216 0.093908 0.095271 0.097344 0.122624 0.093873 0.094601 0.088246 0.098826 0.096155 0.080253 0.120516 0.113456 0.161835 0.169975 0.111138 0.098611 0.143510 0.139129 0.156962 0.155600 0.157716
qa: -0.2929 -0.4686 -0.2836 0.1559 -0.0534 -0.0665 -0.2947 -0.2720 -0.2704 0.3571 -0.0142 -0.2287 -0.2464 0.1105 -0.0470 -0.3278 -0.0584 0.1963 -0.0203 0.0016 -0.2092 -0.1732 -0.1421 -0.1525 -0.1714 0.1013 0.0917 0.0902 0.0981 0.1012 0.0939 0.0953 0.0973 0.1226 0.0939 0.0946 0.0882 0.0988 0.0962 0.0803 0.1205 0.1135 0.1618 0.1700 0.1111 0.0986 0.1435 0.1391 0.1570 0.1556 0.1577
va: 2.1173 2.0246 2.2722 3.7190 3.8551 3.7978 3.9136 3.8774 3.8802 4.1795 3.7090 3.9294 3.9429 3.8210 3.6643 3.9863 3.9521 3.6508 3.8002 3.6353 3.9389 3.9211 3.8820 3.8967 3.8999 1.0251 1.0331 1.0013 1.0028 0.9986 1.0022 1.0179 1.0020 1.0029 0.9964 0.9957 1.0070 0.9986 0.9983 1.0159 0.9904 1.0132 1.0014 0.9984 1.0073 1.0067 1.0014 1.0042 0.9907 0.9914 0.9904
dispcorr: -0.022775837 hartree
energy: -1079.775177913962
dipole: 25.68967 -25.41529 0.27438 9.02212 -9.61080 -0.58868 -8.27309 7.72822 -0.54487
magnitude: 0.84777 au
magnitude: 2.15486 debye
