program: Orca
programVersion: 5.0.2
elementType: O O O C C C C C C C C C C C C C C C C C C C C C C H H H H H H H H H H H H H H H H H H H H H H H H H H
charge: 0
multiplicity: 1
keywords: wb97x-d3
keywords: def2-TZVPP
keywords: def2/J RIJCOSX
keywords: DEFGRID2
keywords: scfconv7
keywords: smallprint printgap noloewdin
keywords: NOSOSCF
formula: C22H26O3
InChI: InChI=1/C22H26O3/c1-15(2)10-19-20(22(19,3)4)21(23)25-14-17-12-18(24-13-17)11-16-8-6-5-7-9-16/h5-10,12-13,19-20H,11,14H2,1-4H3
51 atoms
O  1.896431 -2.098317 -0.255766
O  1.955127 -0.536634 1.343884
O  -2.110463 -0.967787 -0.760928
C  4.623541 0.309519 -0.097741
C  3.507767 1.189751 -0.540666
C  3.335768 -0.323388 -0.602471
C  5.820756 0.119245 -0.998135
C  4.980775 0.263605 1.367722
C  3.536209 1.982149 -1.793382
C  2.346135 -0.959729 0.281936
C  2.466168 2.555027 -2.351883
C  2.582372 3.372615 -3.601534
C  1.079811 2.435166 -1.796995
C  0.850097 -2.791006 0.418323
C  -0.481692 -2.196044 0.114363
C  -1.730778 -2.589402 0.69321
C  -0.777961 -1.210522 -0.763622
C  -2.682335 -1.811255 0.124658
C  -4.149055 -1.701148 0.328957
C  -4.540737 -0.392817 0.976197
C  -5.282443 0.55669 0.282913
C  -4.15122 -0.115191 2.284985
C  -5.634383 1.759401 0.884734
C  -4.500022 1.083371 2.88809
C  -5.244794 2.025887 2.188798
H  2.951879 1.642842 0.275519
H  3.40675 -0.768965 -1.588144
H  6.336463 -0.811435 -0.753667
H  6.535536 0.934578 -0.867332
H  5.554986 0.075669 -2.054298
H  4.146072 0.505092 2.021584
H  5.773604 0.986116 1.572075
H  5.357265 -0.722021 1.649287
H  4.500528 2.115834 -2.274802
H  1.962182 2.958203 -4.400912
H  2.229333 4.394437 -3.437489
H  3.60854 3.426869 -3.965347
H  0.693545 3.414997 -1.502633
H  0.394032 2.054432 -2.558547
H  1.012075 1.778395 -0.930765
H  1.02673 -2.823344 1.495857
H  0.90401 -3.817538 0.052802
H  -1.8929 -3.3500 1.441314
H  -0.183938 -0.614026 -1.438688
H  -4.461658 -2.538106 0.956443
H  -4.672074 -1.812398 -0.624742
H  -5.592046 0.355733 -0.736103
H  -3.568771 -0.84417 2.837217
H  -6.214138 2.487623 0.331697
H  -4.191565 1.282398 3.90673
H  -5.518552 2.961485 2.6596
elementType: O C H
totalener: -1079.75285142 hartree
nucrepener: 2094.37692665 hartree
electener: -3174.12977807 hartree
oneelecener: -5628.11756845 hartree
twoeener: 2453.98779038 hartree
cpcmener: -0.02663773 hartree
kineticenergy: 1074.85167606 hartree
xcener: -106.461153783738 hartree
chargesum: -0.0000000
charge: -0.292638 -0.468608 -0.284328 0.153867 -0.036137 -0.065851 -0.293157 -0.273591 -0.277359 0.353204 -0.001718 -0.230661 -0.267351 0.106582 -0.031675 -0.347921 -0.061798 0.212788 -0.063550 0.025162 -0.181877 -0.186167 -0.155044 -0.160704 -0.168638 0.101179 0.090020 0.098573 0.101797 0.088643 0.092825 0.093791 0.098750 0.123545 0.094313 0.094508 0.088338 0.106036 0.097056 0.077973 0.112799 0.122445 0.159002 0.180084 0.117338 0.106315 0.138833 0.142793 0.156108 0.156636 0.157469
qa: -0.2926 -0.4686 -0.2843 0.1539 -0.0361 -0.0659 -0.2932 -0.2736 -0.2774 0.3532 -0.0017 -0.2307 -0.2674 0.1066 -0.0317 -0.3479 -0.0618 0.2128 -0.0635 0.0252 -0.1819 -0.1862 -0.1550 -0.1607 -0.1686 0.1012 0.0900 0.0986 0.1018 0.0886 0.0928 0.0938 0.0988 0.1235 0.0943 0.0945 0.0883 0.1060 0.0971 0.0780 0.1128 0.1224 0.1590 0.1801 0.1173 0.1063 0.1388 0.1428 0.1561 0.1566 0.1575
va: 2.1168 2.0257 2.2695 3.7329 3.8235 3.7936 3.9168 3.8820 3.8894 4.1781 3.6866 3.9305 3.9503 3.8271 3.6383 4.0062 3.9490 3.6168 3.8244 3.6235 3.9461 3.9360 3.8969 3.9112 3.8998 1.0235 1.0337 1.0025 0.9985 1.0017 1.0191 1.0008 0.9994 1.0039 0.9965 0.9956 1.0070 1.0002 0.9962 1.0124 1.0131 0.9907 1.0061 0.9891 1.0054 1.0085 1.0042 1.0038 0.9913 0.9917 0.9905
dispcorr: -0.023041364 hartree
energy: -1079.775892786408
dipole: 18.91594 -18.78701 0.12892 12.50565 -13.03562 -0.52998 -7.48877 6.79545 -0.69331
magnitude: 0.88214 au
magnitude: 2.24223 debye
