program: Orca
programVersion: 5.0.2
elementType: O O O C C C C C C C C C C C C C C C C C C C C C C H H H H H H H H H H H H H H H H H H H H H H H H H H
charge: 0
multiplicity: 1
keywords: wb97x-d3
keywords: def2-TZVPP
keywords: def2/J RIJCOSX
keywords: DEFGRID2
keywords: scfconv7
keywords: smallprint printgap noloewdin
keywords: NOSOSCF
formula: C22H26O3
InChI: InChI=1/C22H26O3/c1-15(2)10-19-20(22(19,3)4)21(23)25-14-17-12-18(24-13-17)11-16-8-6-5-7-9-16/h5-10,12-13,19-20H,11,14H2,1-4H3
51 atoms
O  1.731501 -2.067057 0.166835
O  1.252795 -1.300458 -1.879066
O  -2.572423 -2.492223 -0.392931
C  1.134246 1.359831 -0.156914
C  2.268572 1.382162 -1.130667
C  2.106848 0.188038 -0.213558
C  1.199025 2.197346 1.097193
C  -0.272757 1.212419 -0.685245
C  3.434266 2.286379 -0.992139
C  1.6617 -1.107402 -0.758185
C  4.501568 2.294117 -1.796123
C  5.611809 3.281232 -1.600708
C  4.691958 1.345427 -2.939794
C  0.989045 -3.273414 -0.081035
C  -0.461041 -2.983929 0.070825
C  -1.118678 -2.564459 1.272401
C  -1.397229 -2.913722 -0.903336
C  -2.395215 -2.272748 0.93153
C  -3.525758 -1.67207 1.688646
C  -3.48765 -0.164074 1.592648
C  -2.821183 0.581764 2.56088
C  -4.057797 0.499229 0.509523
C  -2.728424 1.962629 2.453436
C  -3.965305 1.8804 0.39885
C  -3.3003 2.616431 1.370168
H  1.970534 1.176452 -2.154505
H  2.779977 0.118786 0.634133
H  0.88855 3.22462 0.893676
H  2.195176 2.229887 1.538016
H  0.521735 1.795509 1.853844
H  -0.914722 0.713428 0.044774
H  -0.326884 0.653136 -1.617143
H  -0.697727 2.199975 -0.876095
H  3.405687 3.008158 -0.181205
H  5.758647 3.890002 -2.497213
H  5.421744 3.955529 -0.765524
H  6.562269 2.773527 -1.415247
H  3.924833 0.574608 -2.997194
H  4.703174 1.879997 -3.893857
H  5.658876 0.841633 -2.860186
H  1.341349 -3.973642 0.675032
H  1.221879 -3.690294 -1.061851
H  -0.685382 -2.475082 2.25677
H  -1.373491 -3.127429 -1.960634
H  -3.446383 -1.979201 2.732325
H  -4.477385 -2.055981 1.314127
H  -2.370358 0.077874 3.408289
H  -4.579488 -0.066142 -0.253947
H  -2.210811 2.527962 3.218256
H  -4.414504 2.38272 -0.448623
H  -3.229884 3.693282 1.284521
elementType: O C H
totalener: -1079.75154917 hartree
nucrepener: 2195.02769103 hartree
electener: -3274.77924021 hartree
oneelecener: -5829.63284464 hartree
twoeener: 2554.85360443 hartree
cpcmener: -0.02464387 hartree
kineticenergy: 1074.86134843 hartree
xcener: -106.462028969947 hartree
chargesum: -0.0000000
charge: -0.287160 -0.463971 -0.272869 0.199897 -0.061435 -0.055503 -0.315516 -0.261935 -0.260470 0.359063 -0.023042 -0.231996 -0.253198 0.092701 -0.059291 -0.344153 -0.030166 0.207431 -0.058789 0.046047 -0.169374 -0.188207 -0.183202 -0.158441 -0.161414 0.100247 0.092179 0.105911 0.091875 0.095261 0.045311 0.100435 0.105031 0.121434 0.093215 0.087742 0.093597 0.082279 0.098341 0.093427 0.119958 0.115028 0.157080 0.171546 0.109281 0.111449 0.137646 0.137514 0.157672 0.155300 0.156232
qa: -0.2872 -0.4640 -0.2729 0.1999 -0.0614 -0.0555 -0.3155 -0.2619 -0.2605 0.3591 -0.0230 -0.2320 -0.2532 0.0927 -0.0593 -0.3442 -0.0302 0.2074 -0.0588 0.0460 -0.1694 -0.1882 -0.1832 -0.1584 -0.1614 0.1002 0.0922 0.1059 0.0919 0.0953 0.0453 0.1004 0.1050 0.1214 0.0932 0.0877 0.0936 0.0823 0.0983 0.0934 0.1200 0.1150 0.1571 0.1715 0.1093 0.1114 0.1376 0.1375 0.1577 0.1553 0.1562
va: 2.1053 2.0333 2.2708 3.6850 3.8543 3.8015 3.9169 3.8799 3.8959 4.2179 3.7164 3.9310 3.9432 3.8460 3.6399 3.9808 3.9490 3.6118 3.8167 3.5973 3.8798 3.9270 3.8735 3.8866 3.8538 1.0213 1.0326 0.9978 1.0046 1.0039 1.0111 1.0247 1.0007 1.0055 0.9952 1.0076 0.9964 1.0169 0.9970 0.9981 0.9921 1.0098 1.0110 1.0000 1.0104 1.0136 1.0042 1.0097 0.9910 0.9916 0.9914
dispcorr: -0.027277506 hartree
energy: -1079.778826681006
dipole: 16.46074 -16.32861 0.13213 18.97161 -18.76661 0.20500 -2.63898 3.74878 1.10980
magnitude: 1.13628 au
magnitude: 2.88820 debye
