program: Orca
programVersion: 5.0.2
elementType: O O O C C C C C C C C C C C C C C C C C C C C C C H H H H H H H H H H H H H H H H H H H H H H H H H H
charge: 0
multiplicity: 1
keywords: wb97x-d3
keywords: def2-TZVPP
keywords: def2/J RIJCOSX
keywords: DEFGRID2
keywords: scfconv7
keywords: smallprint printgap noloewdin
keywords: NOSOSCF
formula: C22H26O3
InChI: InChI=1/C22H26O3/c1-15(2)10-19-20(22(19,3)4)21(23)25-14-17-12-18(24-13-17)11-16-8-6-5-7-9-16/h5-10,12-13,19-20H,11,14H2,1-4H3
51 atoms
O  1.413661 -1.321953 0.178825
O  2.112112 0.514946 1.249409
O  -2.162046 0.754781 -0.521947
C  4.747978 -0.133729 -0.384923
C  4.016392 1.014254 -1.013165
C  3.268032 -0.266943 -0.700529
C  5.671314 -0.983639 -1.224236
C  5.219559 0.01483 1.04053
C  4.205891 1.405511 -2.424113
C  2.23304 -0.280998 0.349443
C  4.419509 2.641106 -2.889352
C  4.589994 2.884486 -4.359342
C  4.520112 3.872941 -2.043142
C  0.297757 -1.46803 1.052366
C  -0.862583 -0.651847 0.596628
C  -2.19147 -0.71564 1.128027
C  -0.908233 0.257565 -0.40296
C  -2.936587 0.15773 0.408409
C  -4.367006 0.569185 0.461509
C  -5.229047 -0.468219 1.129015
C  -5.757546 -0.257134 2.397266
C  -5.505368 -1.669981 0.478936
C  -6.547835 -1.225106 3.006732
C  -6.292885 -2.637341 1.083449
C  -6.817102 -2.417466 2.351999
H  3.805507 1.82437 -0.32323
H  3.047835 -0.907872 -1.547399
H  6.646301 -0.503627 -1.331653
H  5.283633 -1.173789 -2.224403
H  5.832155 -1.952791 -0.747376
H  4.619859 0.712038 1.621587
H  6.24637 0.386358 1.047731
H  5.216268 -0.946585 1.558779
H  4.163418 0.598547 -3.150327
H  4.503744 1.96811 -4.9435
H  3.841547 3.59043 -4.729728
H  5.565162 3.329937 -4.57466
H  3.794549 4.622143 -2.367772
H  4.361664 3.695196 -0.981941
H  5.505468 4.331871 -2.156015
H  0.570008 -1.231813 2.08376
H  0.045564 -2.528837 1.021947
H  -2.53653 -1.341865 1.936027
H  -0.17743 0.636291 -1.100694
H  -4.722643 0.746232 -0.557758
H  -4.461087 1.524768 0.986541
H  -5.553524 0.672863 2.915143
H  -5.100359 -1.848784 -0.510741
H  -6.953667 -1.043389 3.993939
H  -6.500941 -3.564083 0.563682
H  -7.433641 -3.171584 2.824277
elementType: O C H
totalener: -1079.75364984 hartree
nucrepener: 2022.33620814 hartree
electener: -3102.08985798 hartree
oneelecener: -5483.67798487 hartree
twoeener: 2381.58812689 hartree
cpcmener: -0.02608378 hartree
kineticenergy: 1074.84570672 hartree
xcener: -106.461436385544 hartree
chargesum: 0.0000000
charge: -0.288060 -0.465093 -0.282843 0.101454 0.046492 -0.097480 -0.268050 -0.275415 -0.277838 0.372734 -0.050731 -0.217108 -0.249402 0.104342 -0.040260 -0.329633 -0.053902 0.194495 -0.018696 -0.002483 -0.171683 -0.205666 -0.154877 -0.145141 -0.169590 0.093054 0.087310 0.097808 0.087384 0.097391 0.091266 0.095274 0.098076 0.115899 0.087313 0.092863 0.092636 0.094187 0.089648 0.095918 0.113160 0.124862 0.161379 0.164313 0.110806 0.099702 0.139640 0.143025 0.156609 0.156870 0.158039
qa: -0.2881 -0.4651 -0.2828 0.1015 0.0465 -0.0975 -0.2681 -0.2754 -0.2778 0.3727 -0.0507 -0.2171 -0.2494 0.1043 -0.0403 -0.3296 -0.0539 0.1945 -0.0187 -0.0025 -0.1717 -0.2057 -0.1549 -0.1451 -0.1696 0.0931 0.0873 0.0978 0.0874 0.0974 0.0913 0.0953 0.0981 0.1159 0.0873 0.0929 0.0926 0.0942 0.0896 0.0959 0.1132 0.1249 0.1614 0.1643 0.1108 0.0997 0.1396 0.1430 0.1566 0.1569 0.1580
va: 2.1211 2.0360 2.2724 3.7082 3.7594 3.8259 3.9088 3.9054 3.8706 4.1972 3.7664 3.9209 3.9415 3.8241 3.6638 3.9862 3.9520 3.6546 3.7998 3.6377 3.9181 3.9368 3.8985 3.8857 3.8978 1.0329 1.0371 1.0017 1.0062 1.0020 1.0192 1.0002 0.9997 1.0117 1.0091 0.9965 0.9962 0.9974 1.0105 0.9970 1.0124 0.9921 1.0020 0.9994 1.0076 1.0056 1.0043 1.0017 0.9911 0.9906 0.9902
dispcorr: -0.021722821 hartree
energy: -1079.775372661524
dipole: 27.73351 -27.59934 0.13418 7.66064 -8.28070 -0.62006 -10.32477 9.81469 -0.51008
magnitude: 0.81404 au
magnitude: 2.06912 debye
