program: Orca
programVersion: 5.0.2
elementType: O O O C C C C C C C C C C C C C C C C C C C C C C H H H H H H H H H H H H H H H H H H H H H H H H H H
charge: 0
multiplicity: 1
keywords: wb97x-d3
keywords: def2-TZVPP
keywords: def2/J RIJCOSX
keywords: DEFGRID2
keywords: scfconv7
keywords: smallprint printgap noloewdin
keywords: NOSOSCF
formula: C22H26O3
InChI: InChI=1/C22H26O3/c1-15(2)10-19-20(22(19,3)4)21(23)25-14-17-12-18(24-13-17)11-16-8-6-5-7-9-16/h5-10,12-13,19-20H,11,14H2,1-4H3
51 atoms
O  1.148645 -1.482221 -1.408012
O  2.415757 -2.543699 0.093596
O  -1.673658 -3.28487 1.496017
C  2.249261 0.951043 0.280223
C  2.657428 0.975179 -1.166192
C  2.883292 -0.274936 -0.357634
C  3.095516 1.684036 1.291036
C  0.777768 0.962413 0.615894
C  3.833978 1.754009 -1.628755
C  2.139557 -1.541727 -0.525125
C  3.78023 2.960583 -2.199537
C  5.025485 3.668186 -2.639825
C  2.50559 3.707752 -2.44325
C  0.283543 -2.62455 -1.523834
C  -0.67255 -2.686878 -0.388384
C  -1.736367 -1.767407 -0.112118
C  -0.684929 -3.579583 0.627335
C  -2.305644 -2.174259 1.046366
C  -3.439731 -1.659623 1.86198
C  -3.757887 -0.225017 1.534972
C  -4.942989 0.119283 0.895952
C  -2.859035 0.786676 1.871128
C  -5.231013 1.447087 0.601246
C  -3.142288 2.111501 1.577744
C  -4.332191 2.446274 0.941626
H  1.824661 0.936725 -1.861646
H  3.904743 -0.455968 -0.037356
H  4.162242 1.608477 1.080867
H  2.927545 1.286741 2.294277
H  2.837732 2.745594 1.309246
H  0.449264 1.988147 0.79838
H  0.574843 0.388537 1.522845
H  0.153405 0.564458 -0.181327
H  4.809992 1.299903 -1.480527
H  4.997987 3.88574 -3.7111
H  5.129808 4.631622 -2.133417
H  5.924322 3.084821 -2.439314
H  1.621614 3.185427 -2.080543
H  2.535358 4.685197 -1.95435
H  2.365334 3.903717 -3.509808
H  0.865073 -3.54351 -1.607824
H  -0.238449 -2.471961 -2.467545
H  -2.025813 -0.91387 -0.704902
H  -0.074228 -4.438947 0.856961
H  -3.187103 -1.750642 2.922843
H  -4.326477 -2.281805 1.707217
H  -5.651341 -0.655721 0.627444
H  -1.929383 0.535122 2.369109
H  -6.161175 1.697883 0.107236
H  -2.435892 2.885606 1.84989
H  -4.556116 3.481085 0.715794
elementType: O C H
totalener: -1079.75137156 hartree
nucrepener: 2143.52914848 hartree
electener: -3223.28052004 hartree
oneelecener: -5725.90452130 hartree
twoeener: 2502.62400126 hartree
cpcmener: -0.02564445 hartree
kineticenergy: 1074.86173151 hartree
xcener: -106.462442478146 hartree
chargesum: -0.0000000
charge: -0.273508 -0.468510 -0.279788 0.170881 0.022298 -0.146965 -0.272205 -0.334966 -0.281855 0.408584 -0.030787 -0.229907 -0.250912 0.067437 -0.065688 -0.367512 -0.019336 0.220165 -0.024457 0.016781 -0.171732 -0.230065 -0.154031 -0.140127 -0.170569 0.101994 0.093965 0.091784 0.099435 0.094311 0.100689 0.107615 0.094494 0.119360 0.094026 0.093548 0.088721 0.086551 0.095216 0.099317 0.117568 0.118050 0.165130 0.172608 0.111073 0.099076 0.138219 0.154056 0.156585 0.156368 0.157013
qa: -0.2735 -0.4685 -0.2798 0.1709 0.0223 -0.1470 -0.2722 -0.3350 -0.2819 0.4086 -0.0308 -0.2299 -0.2509 0.0674 -0.0657 -0.3675 -0.0193 0.2202 -0.0245 0.0168 -0.1717 -0.2301 -0.1540 -0.1401 -0.1706 0.1020 0.0940 0.0918 0.0994 0.0943 0.1007 0.1076 0.0945 0.1194 0.0940 0.0935 0.0887 0.0866 0.0952 0.0993 0.1176 0.1180 0.1651 0.1726 0.1111 0.0991 0.1382 0.1541 0.1566 0.1564 0.1570
va: 2.1183 2.0338 2.2799 3.6875 3.7540 3.9027 3.8993 3.9071 3.8590 4.2038 3.7074 3.9291 3.9418 3.8508 3.6552 3.9576 3.9771 3.6167 3.8085 3.6205 3.9257 3.9330 3.8953 3.8822 3.9079 1.0180 1.0332 1.0030 1.0024 1.0025 1.0016 0.9973 1.0052 1.0083 0.9954 0.9964 1.0080 1.0087 0.9977 0.9983 1.0077 0.9934 1.0007 1.0002 1.0069 1.0070 1.0044 0.9946 0.9909 0.9926 0.9906
dispcorr: -0.025643664 hartree
energy: -1079.777015224715
dipole: 13.74905 -14.52308 -0.77403 24.97645 -23.64467 1.33178 -5.54550 4.96643 -0.57906
magnitude: 1.64562 au
magnitude: 4.18284 debye
