program: Gaussian 09
title: 000063657
version: EM64L-G09RevD.01
frameworkgroup: C1[X(C24H19N3O4S)]
method: RPBEPBE
basis: SDD
operation: Freq
keyword: #p
keyword: freq=noraman
keyword: PBEPBE/SDD
title: #p freq=noraman PBEPBE/SDD
converged: YES YES NO NO
title: Mulliken charges:
elementType: S O O O O N N N C C C C C C C C C C C C C C C C C C C C C C C C H H H H H H H H H H H H H H H H H H H
charge: 0.207313 -0.219083 -0.231795 -0.286393 -0.439364 -0.133334 -0.239685 -0.028526 -0.705612 0.710751 0.322984 -0.772301 0.064685 0.207826 0.171844 -0.451669 -0.469843 0.042127 0.300972 0.230219 -0.358691 -0.327244 0.162325 -0.350710 -0.373218 -0.344738 -0.244470 -0.206773 -0.231076 -0.242295 -0.225913 -0.523586 0.320331 0.304216 0.284905 0.298197 0.235121 0.218502 0.272945 0.263120 0.261810 0.283771 0.235908 0.235216 0.231351 0.235921 0.233659 0.362176 0.258797 0.232747 0.216578
chargesum: 0.00000
title: Mulliken charges with hydrogens summed into heavy atoms:
elementType: S O O O O N N N C C C C C C C C C C C C C C C C C C C C C C C C
charge: 0.207313 -0.219083 -0.231795 -0.286393 -0.077187 -0.133334 -0.239685 -0.028526 -0.385280 0.710751 0.322984 -0.183179 0.064685 0.207826 0.171844 -0.153472 -0.234722 0.042127 0.300972 0.230219 -0.140190 -0.054299 0.162325 -0.087590 -0.111408 -0.060967 -0.008562 0.028443 0.000275 -0.006374 0.007746 0.184537
polarizability: 3.77972703e+02 -7.06800103e+01 2.82377414e+02 1.67824505e+01 1.68994153e+01 2.93311726e+02
1716.lowfreq: -4.1004 -0.0011 0.0003 0.0006 2.4309 7.4117 12.8170 16.8743 26.6143
frequency: 11.2628 16.6856 26.4966 42.5495 44.8612 50.5347 56.9755 72.1066 78.2688 89.4475 99.7905 118.7630 123.4767 138.1013 143.6509 170.0063 189.1726 201.3219 229.4830 250.7393 261.7847 276.5597 277.4233 304.7419 327.5841 340.2155 355.0113 375.2180 379.3380 392.7814 408.9768 426.3140 444.0462 457.0272 465.9066 466.4016 486.8230 505.2280 532.7474 539.9081 556.9262 569.4269 570.8289 600.1973 612.6915 619.9200 644.8670 665.3083 679.4104 687.6219 691.5442 706.6896 708.6904 726.2170 735.1456 757.4455 777.1706 783.3946 784.5313 789.0565 796.5250 815.7947 860.1827 863.8972 892.5961 897.3617 900.1155 904.2867 912.4429 923.1251 944.1358 980.1925 983.3889 988.1771 990.2027 997.6830 1003.5955 1006.0719 1025.3746 1029.3363 1081.6116 1083.9366 1085.4525 1103.4605 1112.4480 1122.2491 1125.6160 1153.6229 1159.3664 1163.7259 1169.6179 1169.9063 1174.6481 1194.4136 1210.0437 1214.5663 1231.2210 1232.8221 1256.5546 1264.9985 1268.2865 1276.6719 1313.0018 1323.1449 1323.2927 1349.8363 1379.6036 1392.0603 1400.1675 1421.8258 1434.0316 1436.4163 1445.3018 1451.8843 1457.8529 1459.5857 1479.3523 1484.0338 1501.1375 1543.2379 1564.8359 1586.1114 1593.8796 1609.1760 1612.7869 1616.2455 1622.5651 1642.6129 2974.7234 3024.3935 3043.4032 3082.8660 3110.8191 3115.1029 3128.3156 3130.0639 3136.7556 3138.9550 3139.9413 3149.8180 3150.7403 3159.2164 3165.2163 3169.2840 3170.0551 3174.9551 3578.5027
redmass: 6.6736 5.3426 5.1495 5.4887 4.2438 4.0228 4.3397 3.3707 3.7739 5.1358 8.0723 6.1786 4.3965 1.8661 6.0838 3.8081 4.2653 5.6775 4.8873 7.1551 7.0360 5.8435 5.7521 6.3181 4.7165 6.5014 1.1491 7.3850 5.3320 7.3709 3.0640 5.8875 4.4218 5.4469 4.2518 5.5968 5.0982 8.7945 6.3768 3.6866 4.0475 6.3961 6.5816 6.0177 6.2202 5.8899 6.6815 6.4267 4.6757 6.1800 5.3753 1.9079 4.3205 5.2060 4.1526 5.7584 2.0621 1.9259 4.4720 2.3247 2.0191 3.3082 4.5216 1.3071 4.1831 1.5288 4.4738 1.6866 1.7863 1.3761 1.4384 1.3755 6.8815 2.6514 1.8805 3.7849 1.3363 1.3419 2.2390 2.1697 2.3189 3.6117 1.8778 2.0057 1.2411 2.7499 1.3777 1.4373 1.7454 1.2083 1.2795 1.6369 1.0569 1.1200 2.2265 2.7913 1.4253 2.1614 2.8680 2.6372 2.2450 1.9955 3.0571 3.0593 1.3733 1.7938 7.7101 10.1766 5.6085 1.5058 2.2600 1.0948 1.7112 2.6183 1.0679 2.6854 1.0540 2.4437 3.0441 10.6842 6.9647 6.1545 6.4420 5.9848 6.6257 7.3100 10.8043 11.9198 1.0343 1.0858 1.0567 1.0983 1.0879 1.1068 1.1041 1.0852 1.0862 1.0889 1.0955 1.0933 1.0901 1.0965 1.0956 1.0922 1.1015 1.0999 1.0660
irintensity: 0.2820 0.5361 0.4581 0.4263 0.3007 7.6686 1.2860 4.7066 0.9962 1.3704 1.5844 3.0593 1.8976 0.7324 1.3095 3.6929 0.9604 0.5124 1.2053 0.0182 2.3988 1.5461 2.0970 2.6606 7.4638 1.9042 115.0719 7.6672 8.2268 0.2225 0.4469 7.0969 5.2123 3.6477 9.0283 3.0130 12.7528 5.0636 23.4899 17.0592 8.0622 2.6410 1.8431 4.7747 2.2100 10.3310 20.2901 6.4569 13.2748 5.0771 11.7110 77.1444 2.3680 1.2943 6.1630 8.0173 89.3239 43.8693 6.0303 21.9844 32.7191 1.0823 5.7362 3.2552 11.4122 2.4151 15.9836 21.7043 26.5174 4.2723 5.0309 3.0443 14.4845 0.6419 0.9025 16.9580 0.0208 1.0578 16.9877 3.6539 146.8617 7.8365 12.9798 21.0692 7.5619 14.7946 8.3331 34.7578 9.9829 53.4101 12.3309 35.1869 0.3599 8.9840 13.2506 7.1178 50.5068 84.4081 12.2588 101.3416 212.9997 13.3182 173.1277 46.2798 1.4671 16.6999 0.9714 36.0413 5.6439 13.4495 11.9456 9.8802 21.6953 4.7486 12.7736 48.4603 16.9442 37.9803 86.1100 239.4649 1.0293 8.0650 27.4427 6.5833 26.6213 94.6918 168.1912 207.3194 62.3980 8.6046 10.7316 39.4544 17.0187 1.4340 16.1589 0.0273 4.2315 10.4744 6.7362 8.2758 7.2733 16.1224 9.7452 0.9606 27.2879 22.7064 47.7004
temp: 298.150 k
press: 1.00000 atm
elementType: 16 8 8 8 8 7 7 7 6 6 6 6 6 6 6 6 6 6 6 6 6 6 6 6 6 6 6 6 6 6 6 6 1 1 1 1 1 1 1 1 1 1 1 1 1 1 1 1 1 1 1
symmnumber: 1
zpe: 996499.1 jmol-1
zpe.correction: 0.379546 hartree
zpe.thermalcorrener: 0.407307 hartree
zpe.thermalcorrenthalpy: 0.408251 hartree
zpe.thermalcorrgfe: 0.318355 hartree
zpe.sumelectzpe: -1786.912032 hartree
zpe.sumelectthermal: -1786.884272 hartree
zpe.sumelectthermalent: -1786.883327 hartree
zpe.sumelectthermalfe: -1786.973224 hartree
dipole: -0.7412 1.0506 6.0375
dipole: 6.1729
quadrupole: -170.2406 -191.5796 -180.3281
quadrupole: -20.1588 -2.3837 -0.5216
quadrupole: 10.4755 -10.8635 0.3880 -20.1588 -2.3837 -0.5216
hfenergy: -1787.2915789 hartree
pointgroup: C01 [X(C24H19N3O4S1)]
dipole: 0.1548924 0.3244925 -2.4018391 debye
polarizability: 306.6893564|83.9666544|351.2878353|16.6198814|-10.3389942|295.6846511 unknown
InChI: InChI=1S/C24H19N3O4S/c1-31-20-13-16(11-12-19(20)28)24-26(21(29)14-32-24)27-22(15-7-3-2-4-8-15)25-18-10-6-5-9-17(18)23(27)30/h2-13,24,28H,14H2,1H3
charge 0 multiplicity 1
51 atoms
S  0.395798 -3.651312 1.545651
O  -1.911071 -0.856927 3.236733
O  0.697674 0.810556 2.464263
O  4.550908 -0.104056 0.703504
O  4.825834 -0.181597 -2.142472
N  -0.676232 -1.195575 1.270878
N  -0.866911 0.130326 0.837107
N  -1.784591 1.63543 -0.787265
C  0.046891 -2.142401 0.385344
C  1.295547 -1.599365 -0.265684
C  -1.1265 -1.556498 2.548534
C  -0.554225 -2.895599 2.990799
C  -1.759536 0.437675 -0.223974
C  -0.034462 1.12559 1.490669
C  -0.123855 2.455841 0.869049
C  2.357103 -1.04793 0.492467
C  1.410601 -1.659533 -1.674714
C  -0.960057 2.651651 -0.276646
C  -2.693457 -0.611214 -0.719832
C  3.519914 -0.557341 -0.130979
C  2.573392 -1.1798 -2.31341
C  0.657054 3.525595 1.378713
C  3.632443 -0.636609 -1.553566
C  -0.989933 3.929527 -0.901361
C  -2.867344 -0.754507 -2.121155
C  -3.468249 -1.404034 0.168312
C  0.614751 4.782216 0.752647
C  -0.209363 4.98015 -0.392001
C  -3.778348 -1.703507 -2.63051
C  -4.385995 -2.344115 -0.347532
C  -4.536323 -2.505597 -1.744859
C  5.110699 1.237779 0.43403
H  -0.650124 -2.511233 -0.387423
H  0.130767 -2.724789 3.836882
H  -1.369826 -3.565095 3.304047
H  2.295481 -0.982688 1.582875
H  0.595427 -2.081172 -2.274407
H  2.663786 -1.238572 -3.40616
H  1.281891 3.338973 2.258186
H  -1.641007 4.061841 -1.770499
H  -2.293922 -0.107119 -2.792413
H  -3.389818 -1.252745 1.249947
H  1.212249 5.611885 1.144617
H  -0.239404 5.96309 -0.874775
H  -3.90295 -1.812692 -3.713367
H  -4.991336 -2.942013 0.342187
H  -5.246659 -3.240287 -2.139868
H  4.815206 -0.342335 -3.118748
H  5.577123 1.281259 -0.563761
H  5.864605 1.390056 1.220913
H  4.316954 2.005015 0.520824
