program: Orca
programVersion: 5.0.2
elementType: O O O C C C C C C C C C C C C C C C C C C C C C C H H H H H H H H H H H H H H H H H H H H H H H H H H
charge: 0
multiplicity: 1
keywords: wb97x-d3
keywords: def2-TZVPP
keywords: def2/J RIJCOSX
keywords: DEFGRID2
keywords: scfconv7
keywords: smallprint printgap noloewdin
keywords: NOSOSCF
formula: C22H26O3
InChI: InChI=1/C22H26O3/c1-15(2)10-19-20(22(19,3)4)21(23)25-14-17-12-18(24-13-17)11-16-8-6-5-7-9-16/h5-10,12-13,19-20H,11,14H2,1-4H3
51 atoms
O  1.300649 -1.406258 -1.219206
O  2.206811 -1.682125 0.80467
O  -2.024872 -2.545017 1.367856
C  1.488667 1.59729 -0.271337
C  2.307047 1.283664 -1.480902
C  2.446034 0.413425 -0.25188
C  1.879546 2.758931 0.609061
C  -0.00305 1.366434 -0.318454
C  3.446654 2.135234 -1.913314
C  1.980171 -0.983682 -0.157191
C  4.554275 1.681759 -2.505908
C  5.6491 2.609985 -2.934739
C  4.80087 0.232374 -2.790841
C  0.643461 -2.683271 -1.131035
C  -0.605136 -2.56325 -0.334965
C  -1.83762 -1.967886 -0.758829
C  -0.785405 -2.890004 0.966077
C  -2.660825 -1.977899 0.314879
C  -4.015832 -1.417573 0.554251
C  -3.929913 -0.124809 1.33227
C  -3.617232 1.064039 0.677177
C  -4.103207 -0.104985 2.712141
C  -3.483524 2.248882 1.385799
C  -3.96837 1.080021 3.424965
C  -3.657555 2.25993 2.764168
H  1.745244 0.830346 -2.293534
H  3.334801 0.576387 0.348251
H  2.959919 2.887128 0.680999
H  1.49795 2.615373 1.621991
H  1.45725 3.692025 0.229193
H  -0.509973 2.294263 -0.592989
H  -0.387007 1.059675 0.656912
H  -0.296702 0.613736 -1.047706
H  3.347327 3.205588 -1.753926
H  6.595441 2.347871 -2.453774
H  5.822906 2.543177 -4.01212
H  5.426777 3.649674 -2.694197
H  4.968551 0.073631 -3.85947
H  5.706774 -0.112807 -2.284964
H  3.981051 -0.415049 -2.484359
H  1.315741 -3.437681 -0.72131
H  0.427072 -2.951324 -2.163937
H  -2.069089 -1.574983 -1.73697
H  -0.149863 -3.361951 1.699083
H  -4.640015 -2.139164 1.087175
H  -4.486142 -1.242673 -0.414775
H  -3.473491 1.062031 -0.397601
H  -4.34761 -1.021872 3.235844
H  -3.242782 3.165084 0.861283
H  -4.105324 1.079859 4.498982
H  -3.551695 3.183424 3.319006
elementType: O C H
totalener: -1079.75075612 hartree
nucrepener: 2165.91876550 hartree
electener: -3245.66952162 hartree
oneelecener: -5771.03999545 hartree
twoeener: 2525.37047383 hartree
cpcmener: -0.02567052 hartree
kineticenergy: 1074.86738645 hartree
xcener: -106.462337503413 hartree
chargesum: -0.0000000
charge: -0.277515 -0.467635 -0.275622 0.187482 0.010176 -0.133191 -0.296882 -0.320864 -0.311129 0.401190 -0.014391 -0.228838 -0.238159 0.066815 -0.043830 -0.404321 -0.016648 0.235679 -0.054504 0.094248 -0.253414 -0.204266 -0.147734 -0.148782 -0.170650 0.105803 0.094229 0.093372 0.098835 0.097221 0.100431 0.107541 0.095175 0.121114 0.094284 0.095033 0.088763 0.099700 0.097256 0.077305 0.118238 0.117757 0.160553 0.170980 0.111026 0.112932 0.143791 0.140043 0.157555 0.156498 0.157350
qa: -0.2775 -0.4676 -0.2756 0.1875 0.0102 -0.1332 -0.2969 -0.3209 -0.3111 0.4012 -0.0144 -0.2288 -0.2382 0.0668 -0.0438 -0.4043 -0.0166 0.2357 -0.0545 0.0942 -0.2534 -0.2043 -0.1477 -0.1488 -0.1706 0.1058 0.0942 0.0934 0.0988 0.0972 0.1004 0.1075 0.0952 0.1211 0.0943 0.0950 0.0888 0.0997 0.0973 0.0773 0.1182 0.1178 0.1606 0.1710 0.1110 0.1129 0.1438 0.1400 0.1576 0.1565 0.1574
va: 2.0933 2.0327 2.2782 3.6887 3.7816 3.8386 3.9033 3.8943 3.8864 4.1509 3.7107 3.9309 3.9332 3.8450 3.6037 3.9893 3.9691 3.5829 3.8186 3.5314 3.9273 3.9724 3.8645 3.8944 3.9072 1.0211 1.0287 1.0019 1.0027 0.9999 1.0015 0.9906 1.0083 1.0033 0.9967 0.9961 1.0065 0.9995 0.9990 1.0207 1.0101 0.9947 1.0084 1.0031 1.0102 1.0088 1.0020 1.0062 0.9910 0.9906 0.9900
dispcorr: -0.026372219 hartree
energy: -1079.777128341638
dipole: 16.31497 -16.80201 -0.48704 17.31994 -16.71753 0.60241 -10.22926 8.98535 -1.24391
magnitude: 1.46540 au
magnitude: 3.72476 debye
