program: Orca
programVersion: 5.0.2
elementType: O O O C C C C C C C C C C C C C C C C C C C C C C H H H H H H H H H H H H H H H H H H H H H H H H H H
charge: 0
multiplicity: 1
keywords: wb97x-d3
keywords: def2-TZVPP
keywords: def2/J RIJCOSX
keywords: DEFGRID2
keywords: scfconv7
keywords: smallprint printgap noloewdin
keywords: NOSOSCF
formula: C22H26O3
InChI: InChI=1/C22H26O3/c1-15(2)10-19-20(22(19,3)4)21(23)25-14-17-12-18(24-13-17)11-16-8-6-5-7-9-16/h5-10,12-13,19-20H,11,14H2,1-4H3
51 atoms
O  1.680687 -1.751465 0.102622
O  1.810764 0.216921 1.156291
O  -1.9800 -0.29558 -1.323044
C  4.74553 0.202869 0.009202
C  3.870719 1.044251 -0.852924
C  3.434404 -0.373051 -0.503037
C  5.986291 -0.426358 -0.577574
C  4.907129 0.57696 1.462379
C  4.194553 1.397218 -2.25635
C  2.248514 -0.565523 0.346607
C  3.316111 1.88896 -3.1353
C  3.73003 2.262479 -4.525615
C  1.868355 2.111338 -2.82106
C  0.460372 -2.05745 0.771778
C  -0.69837 -1.378004 0.127078
C  -2.015895 -1.247454 0.672197
C  -0.739364 -0.784098 -1.087463
C  -2.750709 -0.582597 -0.252406
C  -4.176304 -0.156255 -0.314165
C  -4.819138 -0.109328 1.045902
C  -5.808951 -1.0171 1.404883
C  -4.427776 0.856442 1.971644
C  -6.401034 -0.961673 2.661505
C  -5.015072 0.913988 3.225812
C  -6.005313 0.003153 3.575325
H  3.313649 1.801674 -0.30809
H  3.542706 -1.109929 -1.290786
H  5.845007 -0.765025 -1.603958
H  6.287287 -1.294121 0.012671
H  6.818865 0.280456 -0.570533
H  5.052669 -0.308593 2.084436
H  4.060414 1.13213 1.859531
H  5.791709 1.20658 1.579333
H  5.222562 1.259738 -2.579135
H  3.530481 3.318901 -4.724775
H  4.790475 2.082277 -4.702604
H  3.162856 1.697166 -5.270016
H  1.615034 3.173007 -2.889605
H  1.234638 1.600129 -3.550704
H  1.579629 1.764307 -1.829777
H  0.517656 -1.810201 1.834069
H  0.361661 -3.141642 0.698666
H  -2.357709 -1.601158 1.632332
H  -0.005312 -0.624782 -1.862043
H  -4.736747 -0.834854 -0.9649
H  -4.233202 0.829821 -0.78504
H  -6.124329 -1.773766 0.695943
H  -3.656268 1.570358 1.706588
H  -7.173293 -1.673896 2.923413
H  -4.701868 1.67251 3.932072
H  -6.467609 0.049864 4.55313
elementType: O C H
totalener: -1079.75223829 hartree
nucrepener: 2072.46515660 hartree
electener: -3152.21739490 hartree
oneelecener: -5584.06892085 hartree
twoeener: 2431.85152596 hartree
cpcmener: -0.02501324 hartree
kineticenergy: 1074.84689932 hartree
xcener: -106.461094675394 hartree
chargesum: 0.0000000
charge: -0.292606 -0.468273 -0.284732 0.153891 -0.035731 -0.061764 -0.294293 -0.274285 -0.278413 0.350928 -0.004148 -0.230317 -0.260348 0.112126 -0.048204 -0.324870 -0.063831 0.193336 -0.018484 0.001671 -0.173071 -0.211756 -0.153129 -0.141874 -0.171396 0.100614 0.089643 0.089097 0.098721 0.101392 0.098657 0.093195 0.094099 0.123175 0.094604 0.088353 0.094197 0.104231 0.096432 0.076848 0.112853 0.119909 0.161126 0.178326 0.098908 0.111099 0.138845 0.144794 0.155994 0.156938 0.157523
qa: -0.2926 -0.4683 -0.2847 0.1539 -0.0357 -0.0618 -0.2943 -0.2743 -0.2784 0.3509 -0.0041 -0.2303 -0.2603 0.1121 -0.0482 -0.3249 -0.0638 0.1933 -0.0185 0.0017 -0.1731 -0.2118 -0.1531 -0.1419 -0.1714 0.1006 0.0896 0.0891 0.0987 0.1014 0.0987 0.0932 0.0941 0.1232 0.0946 0.0884 0.0942 0.1042 0.0964 0.0768 0.1129 0.1199 0.1611 0.1783 0.0989 0.1111 0.1388 0.1448 0.1560 0.1569 0.1575
va: 2.1161 2.0266 2.2694 3.7317 3.8230 3.7887 3.9168 3.8824 3.8900 4.1815 3.6908 3.9300 3.9493 3.8194 3.6744 3.9861 3.9473 3.6565 3.7988 3.6334 3.9223 3.9396 3.8955 3.8836 3.8999 1.0239 1.0340 1.0016 1.0024 0.9984 0.9995 1.0190 1.0009 1.0038 0.9954 1.0069 0.9966 1.0003 0.9969 1.0127 1.0131 0.9908 1.0018 0.9914 1.0067 1.0069 1.0046 1.0009 0.9912 0.9908 0.9904
dispcorr: -0.023067692 hartree
energy: -1079.775305982369
dipole: 21.96706 -21.83774 0.12932 8.05724 -8.64601 -0.58877 -8.90120 8.33066 -0.57054
magnitude: 0.83000 au
magnitude: 2.10969 debye
