program: Orca
programVersion: 5.0.2
elementType: O O O C C C C C C C C C C C C C C C C C C C C C C H H H H H H H H H H H H H H H H H H H H H H H H H H
charge: 0
multiplicity: 1
keywords: wb97x-d3
keywords: def2-TZVPP
keywords: def2/J RIJCOSX
keywords: DEFGRID2
keywords: scfconv7
keywords: smallprint printgap noloewdin
keywords: NOSOSCF
formula: C22H26O3
InChI: InChI=1/C22H26O3/c1-15(2)10-19-20(22(19,3)4)21(23)25-14-17-12-18(24-13-17)11-16-8-6-5-7-9-16/h5-10,12-13,19-20H,11,14H2,1-4H3
51 atoms
O  1.318071 -1.400286 -1.162002
O  2.187758 -1.677755 0.877889
O  -2.074676 -2.518614 1.356576
C  1.553134 1.607997 -0.23772
C  2.386323 1.26698 -1.429628
C  2.483019 0.404128 -0.188581
C  1.948134 2.767183 0.644173
C  0.057994 1.405068 -0.312475
C  3.559805 2.075155 -1.851855
C  1.988281 -0.982595 -0.092245
C  4.576793 1.603701 -2.578402
C  5.714794 2.482687 -2.998145
C  4.663524 0.180999 -3.039815
C  0.649164 -2.671478 -1.080666
C  -0.615099 -2.539423 -0.311896
C  -1.831223 -1.9291 -0.760754
C  -0.829457 -2.873074 0.982081
C  -2.680233 -1.9390 0.292566
C  -4.036802 -1.371296 0.502575
C  -3.965717 -0.100268 1.316926
C  -3.584504 1.095264 0.711848
C  -4.223064 -0.108067 2.683513
C  -3.466531 2.259614 1.456104
C  -4.104731 1.056639 3.4321
C  -3.72534 2.243252 2.821266
H  1.829861 0.815554 -2.24615
H  3.363857 0.554344 0.426297
H  3.028382 2.865322 0.75282
H  1.528914 2.643906 1.644804
H  1.565931 3.708133 0.242229
H  -0.347382 1.092772 0.652199
H  -0.236702 0.667262 -1.056162
H  -0.428566 2.344843 -0.582913
H  3.571122 3.122919 -1.565024
H  6.664239 2.107503 -2.606787
H  5.817166 2.502298 -4.086613
H  5.591526 3.509809 -2.654352
H  3.907062 -0.464141 -2.595121
H  4.55338 0.119835 -4.126355
H  5.643329 -0.243668 -2.807167
H  1.307072 -3.428284 -0.652709
H  0.452917 -2.94377 -2.116544
H  -2.035783 -1.527291 -1.741297
H  -0.2160 -3.355655 1.726916
H  -4.685285 -2.100024 0.995327
H  -4.472869 -1.1676 -0.476658
H  -3.374017 1.114374 -0.35177
H  -4.521382 -1.03025 3.168561
H  -3.171351 3.180987 0.969827
H  -4.307986 1.034985 4.495344
H  -3.632981 3.150797 3.404083
elementType: O C H
totalener: -1079.75089875 hartree
nucrepener: 2160.46441216 hartree
electener: -3240.21531091 hartree
oneelecener: -5760.10618782 hartree
twoeener: 2519.89087691 hartree
cpcmener: -0.02588746 hartree
kineticenergy: 1074.86718054 hartree
xcener: -106.462128728370 hartree
chargesum: 0.0000000
charge: -0.276842 -0.468053 -0.275852 0.189106 -0.007112 -0.116871 -0.301140 -0.317855 -0.303085 0.398889 -0.011682 -0.227000 -0.247991 0.067179 -0.045321 -0.402700 -0.016714 0.235453 -0.056417 0.088035 -0.250121 -0.200658 -0.147138 -0.150123 -0.170965 0.105107 0.091864 0.091753 0.098954 0.098455 0.108907 0.095159 0.101067 0.122279 0.094519 0.093895 0.088538 0.079195 0.102222 0.093614 0.118229 0.117710 0.161020 0.171478 0.110742 0.113939 0.144899 0.139937 0.157714 0.156288 0.157495
qa: -0.2768 -0.4681 -0.2759 0.1891 -0.0071 -0.1169 -0.3011 -0.3179 -0.3031 0.3989 -0.0117 -0.2270 -0.2480 0.0672 -0.0453 -0.4027 -0.0167 0.2355 -0.0564 0.0880 -0.2501 -0.2007 -0.1471 -0.1501 -0.1710 0.1051 0.0919 0.0918 0.0990 0.0985 0.1089 0.0952 0.1011 0.1223 0.0945 0.0939 0.0885 0.0792 0.1022 0.0936 0.1182 0.1177 0.1610 0.1715 0.1107 0.1139 0.1449 0.1399 0.1577 0.1563 0.1575
va: 2.0946 2.0326 2.2784 3.6976 3.7951 3.8281 3.9066 3.8894 3.8780 4.1582 3.7089 3.9298 3.9401 3.8451 3.6071 3.9897 3.9692 3.5840 3.8190 3.5386 3.9296 3.9692 3.8710 3.8948 3.9074 1.0203 1.0302 1.0017 1.0024 0.9991 0.9907 1.0082 1.0015 1.0037 0.9968 0.9954 1.0068 1.0191 0.9980 0.9999 1.0103 0.9946 1.0083 1.0026 1.0100 1.0084 1.0007 1.0056 0.9909 0.9907 0.9900
dispcorr: -0.026088617 hartree
energy: -1079.776987362675
dipole: 16.44049 -16.92335 -0.48287 17.05096 -16.45103 0.59994 -10.87054 9.57677 -1.29377
magnitude: 1.50563 au
magnitude: 3.82701 debye
