program: Orca
programVersion: 5.0.2
elementType: O O O C C C C C C C C C C C C C C C C C C C C C C H H H H H H H H H H H H H H H H H H H H H H H H H H
charge: 0
multiplicity: 1
keywords: wb97x-d3
keywords: def2-TZVPP
keywords: def2/J RIJCOSX
keywords: DEFGRID2
keywords: scfconv7
keywords: smallprint printgap noloewdin
keywords: NOSOSCF
formula: C22H26O3
InChI: InChI=1/C22H26O3/c1-15(2)10-19-20(22(19,3)4)21(23)25-14-17-12-18(24-13-17)11-16-8-6-5-7-9-16/h5-10,12-13,19-20H,11,14H2,1-4H3
51 atoms
O  1.431413 -1.994131 -0.686069
O  2.150901 -1.14285 1.251255
O  -2.258116 -1.911879 1.717273
C  4.20531 0.167214 -0.796086
C  3.287281 1.184116 -0.182554
C  2.702792 -0.060568 -0.810112
C  4.848612 0.458978 -2.1301
C  5.089541 -0.648493 0.114589
C  3.028602 2.498596 -0.807105
C  2.081456 -1.091991 0.045136
C  3.166111 3.694503 -0.225131
C  2.851615 4.953837 -0.975843
C  3.630281 3.909266 1.183253
C  0.767738 -3.067168 0.004147
C  -0.587918 -2.667579 0.46787
C  -1.802685 -2.717928 -0.290078
C  -0.934682 -2.167167 1.677813
C  -2.783937 -2.251822 0.516737
C  -4.237767 -2.024234 0.313502
C  -4.566159 -0.557938 0.15977
C  -5.059777 0.18242 1.228539
C  -4.347686 0.083326 -1.057167
C  -5.334352 1.536742 1.08392
C  -4.622347 1.434463 -1.205371
C  -5.116924 2.166633 -0.132948
H  3.28398 1.172738 0.90211
H  2.238137 0.057251 -1.783573
H  5.17457 -0.466525 -2.609063
H  5.730399 1.089869 -1.997272
H  4.180299 0.967946 -2.824161
H  4.67556 -0.783086 1.112384
H  6.056105 -0.152691 0.229526
H  5.27858 -1.638216 -0.307818
H  2.688361 2.478697 -1.838656
H  3.727126 5.606106 -1.036671
H  2.509373 4.755593 -1.991665
H  2.074419 5.530154 -0.466169
H  4.520009 4.544206 1.20031
H  2.868262 4.434423 1.764346
H  3.875862 2.990114 1.711128
H  1.383333 -3.429044 0.828018
H  0.696412 -3.865139 -0.733611
H  -1.923694 -3.066987 -1.303941
H  -0.374127 -1.957283 2.575335
H  -4.803917 -2.448337 1.14692
H  -4.53884 -2.569996 -0.582142
H  -5.237636 -0.30293 2.1811
H  -3.961942 -0.481351 -1.898543
H  -5.72146 2.099467 1.924001
H  -4.452715 1.91608 -2.160115
H  -5.333845 3.220918 -0.248006
elementType: O C H
totalener: -1079.75489493 hartree
nucrepener: 2064.61715258 hartree
electener: -3144.37204750 hartree
oneelecener: -5568.75340552 hartree
twoeener: 2424.38135802 hartree
cpcmener: -0.02569033 hartree
kineticenergy: 1074.85654541 hartree
xcener: -106.459233325848 hartree
chargesum: -0.0000000
charge: -0.282955 -0.477951 -0.276910 0.104198 0.041143 -0.110643 -0.265475 -0.276993 -0.278904 0.405297 -0.043809 -0.221575 -0.251601 0.088744 -0.085347 -0.332603 -0.012784 0.203343 -0.067269 0.052784 -0.194601 -0.195820 -0.153787 -0.156907 -0.172568 0.087756 0.088814 0.097040 0.097017 0.087320 0.091982 0.096140 0.098463 0.117218 0.092967 0.088171 0.092997 0.094345 0.095838 0.090164 0.118841 0.119734 0.160584 0.169072 0.111405 0.115437 0.139510 0.141636 0.156478 0.156780 0.157280
qa: -0.2830 -0.4780 -0.2769 0.1042 0.0411 -0.1106 -0.2655 -0.2770 -0.2789 0.4053 -0.0438 -0.2216 -0.2516 0.0887 -0.0853 -0.3326 -0.0128 0.2033 -0.0673 0.0528 -0.1946 -0.1958 -0.1538 -0.1569 -0.1726 0.0878 0.0888 0.0970 0.0970 0.0873 0.0920 0.0961 0.0985 0.1172 0.0930 0.0882 0.0930 0.0943 0.0958 0.0902 0.1188 0.1197 0.1606 0.1691 0.1114 0.1154 0.1395 0.1416 0.1565 0.1568 0.1573
va: 2.1252 2.0262 2.2840 3.7062 3.7592 3.8556 3.9067 3.9041 3.8724 4.1895 3.7544 3.9228 3.9429 3.8034 3.6304 4.0225 3.9490 3.6272 3.8213 3.5833 3.9599 3.9446 3.8969 3.9051 3.9022 1.0381 1.0365 1.0026 1.0022 1.0057 1.0187 1.0004 0.9997 1.0102 0.9962 1.0088 0.9960 0.9975 0.9970 1.0094 1.0135 0.9955 1.0069 1.0052 1.0089 1.0073 1.0057 1.0035 0.9909 0.9911 0.9906
dispcorr: -0.021648587 hartree
energy: -1079.776543513646
dipole: 23.02857 -23.01731 0.01126 18.45832 -18.55359 -0.09527 -6.39778 5.33452 -1.06326
magnitude: 1.06758 au
magnitude: 2.71358 debye
