program: Gaussian 09
title: 000004953
version: EM64L-G09RevD.01
frameworkgroup: C1[X(C20H30O4)]
method: RPBEPBE
basis: SDD
operation: Freq
keyword: #pfreq=noraman
keyword: PBEPBE/SDD
title: #p freq=noraman PBEPBE/SDD
converged: YES YES NO NO
title: Mulliken charges:
elementType: O O O O C C C C C C C C C C C C C C C C C C C C H H H H H H H H H H H H H H H H H H H H H H H H H H H H H H
charge: -0.194300 -0.445946 -0.415473 -0.237730 -0.188564 -0.262122 -0.533344 0.075409 -0.186277 -0.206398 -0.307256 -0.157655 -0.433267 -0.219013 -0.362911 -0.151473 -0.354551 -0.346020 -0.199870 -0.467643 -0.360073 -0.692982 -0.498606 0.192616 0.253110 0.242816 0.220829 0.245631 0.255920 0.251954 0.269518 0.202656 0.221322 0.207369 0.250231 0.209797 0.187738 0.212816 0.192189 0.186562 0.193302 0.189966 0.229265 0.198150 0.236504 0.335094 0.217120 0.223504 0.217911 0.210681 0.208231 0.259151 0.248183 0.375925
chargesum: 0.00000
title: Mulliken charges with hydrogens summed into heavy atoms:
elementType: O O O O C C C C C C C C C C C C C C C C C C C C
charge: -0.194300 -0.110851 -0.039548 -0.237730 0.064547 -0.019307 -0.066883 0.075409 0.069643 0.045556 -0.037737 0.045002 -0.004575 0.031218 0.034624 0.061343 0.024200 0.037248 0.029395 -0.032989 0.080551 -0.056158 0.008727 0.192616
polarizability: 2.71180261e+02 -2.40426164e+01 2.12531948e+02 -1.39809645e+01 1.45815415e+01 2.07468827e+02
1716.lowfreq: -10.3062 -8.3180 -0.0003 0.0008 0.0009 2.9883 10.6031 13.5452 16.1889
frequency: 10.5494 12.8452 14.1681 20.3385 27.6532 34.5544 39.3676 52.5789 67.9321 75.4250 87.5838 92.5555 100.4633 110.3219 125.0450 133.1829 162.7110 181.8520 194.2965 213.5147 229.7566 243.1290 246.1497 260.0365 277.0491 291.0415 311.3282 342.6546 352.7099 355.7651 372.1459 392.4613 448.1644 452.3430 469.6810 498.2483 510.1016 525.5480 533.4243 564.5388 588.6779 603.0033 645.9560 666.7556 724.6989 737.9358 741.8074 762.6237 779.0532 805.6588 827.4203 830.8404 849.1572 860.9630 864.9521 879.0406 889.3895 914.1996 940.7779 951.8872 961.3737 970.9878 980.2448 984.1444 992.7451 1003.3156 1015.3617 1024.4060 1039.0094 1039.1353 1055.8027 1064.9959 1070.1080 1080.2115 1097.4332 1102.8880 1107.1449 1113.6151 1122.5397 1142.5396 1153.6687 1169.3538 1175.7172 1198.1909 1204.6492 1205.7657 1212.0214 1223.2945 1242.2996 1251.0723 1253.8809 1265.1946 1266.5359 1275.7902 1280.5582 1283.2121 1287.2354 1292.6282 1294.0822 1298.0418 1301.1204 1315.7353 1326.9897 1333.7519 1334.7209 1349.3489 1353.8989 1356.3197 1363.8818 1370.5353 1389.9757 1432.4774 1454.1040 1459.4989 1461.6561 1464.5552 1467.1561 1470.2072 1477.4583 1477.6556 1487.8120 1583.7422 1628.0232 1666.5055 1667.4811 1684.4677 2952.4213 2957.8305 2960.5331 2967.0865 2970.1936 2970.6749 2972.6586 2974.6280 2982.9996 2983.2518 2989.2442 2992.0691 2998.1157 3009.4821 3022.4291 3031.5792 3032.4180 3044.5520 3046.1215 3058.2774 3061.2103 3066.0622 3068.7300 3072.3094 3072.6681 3087.2635 3146.6143 3192.2612 3510.5820 3549.6267
redmass: 4.8650 4.0983 4.9010 5.7580 6.3991 5.0180 4.2899 3.8058 3.2254 2.2558 3.2875 3.6389 3.7623 3.4460 2.5978 3.5714 2.8975 2.4554 2.2413 3.0810 1.2729 2.5395 3.0121 3.0027 3.3856 3.1495 3.2980 1.4610 2.1631 2.7955 2.2906 2.5128 4.0878 2.9561 3.6104 1.9837 3.5443 2.5880 3.3249 3.3428 3.4340 4.0684 1.3428 3.7693 1.1219 3.5222 1.6404 1.3180 1.8026 1.7477 1.7908 1.9269 1.8393 1.9709 2.6179 2.4570 2.0630 1.9254 2.0802 2.7513 1.5392 1.2740 1.3064 1.3166 1.7225 2.5534 3.0036 2.3210 2.0267 2.0159 2.3458 2.1092 2.3961 1.7271 2.2284 2.1304 2.0031 1.5950 2.3182 1.6748 1.5963 2.7349 1.3676 1.4317 1.3020 1.2859 1.4323 1.2816 1.6384 1.4270 1.4371 1.2541 1.3578 1.2933 1.2354 1.2225 1.2080 1.1266 1.2954 1.2887 1.2662 1.2201 1.6761 1.3714 1.4436 1.4297 1.4876 1.5899 1.8062 1.6025 1.2170 1.0889 1.0809 1.0932 1.0729 1.0880 1.0728 1.0988 1.0686 1.0424 1.0844 6.7293 11.5624 7.9971 6.7199 6.5449 1.0648 1.0616 1.0753 1.0603 1.0597 1.0586 1.0361 1.0831 1.0821 1.0647 1.0608 1.0953 1.0614 1.1007 1.0997 1.0992 1.1039 1.0984 1.1017 1.0961 1.0989 1.0916 1.1006 1.0903 1.0993 1.0891 1.0898 1.1048 1.0639 1.0661
irintensity: 0.1160 0.7726 0.5353 0.3098 0.9822 0.4317 0.2009 3.0323 2.0932 0.5121 0.0876 1.0977 1.2630 0.2757 0.4265 0.9533 2.3611 0.2890 0.2763 1.9503 0.5542 1.8779 4.4955 2.3380 3.8419 2.4123 5.7865 95.2662 47.6494 3.7972 9.0864 0.9334 5.6904 9.1550 27.2057 32.3444 8.1181 4.1690 6.9728 7.3144 6.0009 10.5786 130.9735 4.6115 12.3213 4.7566 14.4635 1.8360 8.5393 26.7509 2.1492 9.0483 2.9635 5.1768 8.9887 15.2243 19.2234 2.4612 57.8082 44.4903 30.7571 26.7809 39.7792 6.6473 43.7748 10.7045 55.6239 19.4573 105.5647 116.6838 17.5526 0.6585 0.6757 38.7080 3.9830 6.7627 6.3680 9.3546 6.9540 14.4478 15.5950 66.9569 9.6064 0.4555 11.3634 5.3437 4.3203 9.0097 5.9423 5.4563 5.9912 1.0342 17.8985 0.0343 1.8235 2.7904 2.2122 6.2963 1.8901 7.2016 0.6140 15.5600 10.0941 0.7819 0.3767 13.2656 0.6845 2.6434 56.2708 20.0817 11.4708 33.0871 4.8096 12.2766 2.8903 4.6170 1.0538 15.0264 3.2858 11.9843 16.2668 23.4301 270.2757 180.0543 14.0041 0.0279 8.2607 1.1396 16.8163 103.9221 12.7694 24.0324 42.9083 3.4568 8.2174 39.0066 27.0092 4.3487 20.5243 3.9800 4.3472 8.9134 71.0250 13.6509 70.9220 20.0871 13.3902 14.2098 85.7773 76.6411 48.0729 27.0985 7.1757 11.3395 22.9128 5.2387
temp: 298.150 k
press: 1.00000 atm
elementType: 8 8 8 8 6 6 6 6 6 6 6 6 6 6 6 6 6 6 6 6 6 6 6 6 1 1 1 1 1 1 1 1 1 1 1 1 1 1 1 1 1 1 1 1 1 1 1 1 1 1 1 1 1 1
symmnumber: 1
zpe: 1199389.0 jmol-1
zpe.correction: 0.456823 hartree
zpe.thermalcorrener: 0.484571 hartree
zpe.thermalcorrenthalpy: 0.485516 hartree
zpe.thermalcorrgfe: 0.391841 hartree
zpe.sumelectzpe: -1079.107635 hartree
zpe.sumelectthermal: -1079.079886 hartree
zpe.sumelectthermalent: -1079.078942 hartree
zpe.sumelectthermalfe: -1079.172617 hartree
dipole: -0.8384 2.1848 2.1099
dipole: 3.1509
quadrupole: -145.9209 -160.2926 -151.3794
quadrupole: 7.0656 20.0951 -13.4845
quadrupole: 6.6101 -7.7616 1.1515 7.0656 20.0951 -13.4845
hfenergy: -1079.5644578 hartree
pointgroup: C01 [X(C20H30O4)]
dipole: 0.2697474 0.9477538 -0.7521624 debye
polarizability: 267.8522348|28.2891494|218.2789023|-11.2601669|-14.7318491|205.0498986 unknown
InChI: InChI=1S/C20H30O4/c1-2-3-6-9-17(21)14-12-16-13-15-19(22)18(16)10-7-4-5-8-11-20(23)24/h4,7,12-18,21,23H,2-3,5-6,8-11H2,1H3
charge 0 multiplicity 1
54 atoms
O  -4.424219 -2.879005 1.507679
O  -0.624914 2.859045 -3.252315
O  6.562094 -0.338437 0.120347
O  5.38627 -2.29545 -0.292955
C  -2.590408 -1.539536 0.467529
C  -2.434818 -1.039982 -1.007747
C  -1.44906 -2.465715 0.978573
C  -3.962533 -2.259153 0.51174
C  -3.761069 -1.43215 -1.661611
C  -2.148981 0.44667 -1.135187
C  -4.601956 -2.101201 -0.819956
C  -0.764249 2.461667 -1.825602
C  0.57388 2.872181 -1.177515
C  -1.046664 0.979697 -1.724349
C  0.65871 2.617664 0.345577
C  -0.129722 -1.742744 1.13887
C  -0.306202 3.475755 1.197303
C  -0.11523 3.265874 2.71679
C  1.034877 -2.090252 0.530697
C  2.35548 -1.368806 0.695178
C  2.890287 -0.80721 -0.650453
C  -1.075863 4.120658 3.571172
C  4.251242 -0.096135 -0.513251
C  5.399828 -1.046585 -0.227039
H  -2.654833 -0.668408 1.151602
H  -1.607266 -1.590174 -1.501074
H  -1.33228 -3.325034 0.289833
H  -1.785297 -2.878825 1.951613
H  -3.970764 -1.18281 -2.707741
H  -2.905305 1.117629 -0.695361
H  -5.593552 -2.497574 -1.051145
H  -1.601798 3.027617 -1.364475
H  0.732939 3.946711 -1.393523
H  1.379879 2.320005 -1.700567
H  -0.284122 0.320387 -2.167508
H  0.472824 1.544014 0.55383
H  1.697844 2.825966 0.674366
H  -0.13649 -0.870692 1.814248
H  -0.155138 4.548203 0.953063
H  -1.358212 3.241883 0.933198
H  0.933956 3.504386 2.987161
H  -0.260378 2.192057 2.957229
H  1.044571 -2.964307 -0.141445
H  2.243373 -0.541572 1.424183
H  3.111588 -2.069329 1.103113
H  -1.433485 2.555611 -3.739727
H  2.154535 -0.089415 -1.060527
H  2.983411 -1.635163 -1.378749
H  -0.915341 3.952918 4.651939
H  -0.930396 5.199029 3.370988
H  -2.13154 3.878032 3.34535
H  4.507126 0.444501 -1.446435
H  4.230232 0.672193 0.282634
H  7.303741 -0.984491 0.277154
