program: Orca
programVersion: 5.0.2
elementType: O O O C C C C C C C C C C C C C C C C C C C C C C H H H H H H H H H H H H H H H H H H H H H H H H H H
charge: 0
multiplicity: 1
keywords: wb97x-d3
keywords: def2-TZVPP
keywords: def2/J RIJCOSX
keywords: DEFGRID2
keywords: scfconv7
keywords: smallprint printgap noloewdin
keywords: NOSOSCF
formula: C22H26O3
InChI: InChI=1/C22H26O3/c1-15(2)10-19-20(22(19,3)4)21(23)25-14-17-12-18(24-13-17)11-16-8-6-5-7-9-16/h5-10,12-13,19-20H,11,14H2,1-4H3
51 atoms
O  1.718825 -1.825339 0.157851
O  1.736957 0.171555 1.163114
O  -1.949703 -0.529375 -1.397818
C  4.681036 0.275988 0.048526
C  3.768296 1.071059 -0.817452
C  3.403103 -0.366197 -0.469321
C  5.955188 -0.283825 -0.53724
C  4.817829 0.650853 1.503876
C  4.086229 1.445634 -2.216747
C  2.224176 -0.607188 0.378272
C  3.18551 1.863843 -3.110803
C  3.591412 2.275568 -4.492597
C  1.718594 1.959086 -2.822164
C  0.490412 -2.15633 0.802388
C  -0.667744 -1.509113 0.123223
C  -1.965378 -1.27874 0.682407
C  -0.720501 -1.035475 -1.142779
C  -2.701115 -0.681774 -0.286741
C  -4.107733 -0.198699 -0.353103
C  -4.719877 -0.046211 1.013181
C  -5.689701 -0.93236 1.46783
C  -4.316404 0.992625 1.850202
C  -6.253579 -0.781608 2.729385
C  -4.875696 1.145475 3.109458
C  -5.848667 0.257713 3.553229
H  3.167319 1.797403 -0.27663
H  3.549993 -1.099981 -1.253706
H  6.746972 0.468419 -0.527499
H  5.834499 -0.627125 -1.564764
H  6.303061 -1.134446 0.052089
H  5.010438 -0.229349 2.120736
H  3.940251 1.155559 1.901517
H  5.66546 1.328149 1.627545
H  5.12855 1.399839 -2.519078
H  3.086549 1.6685 -5.248869
H  3.308363 3.312723 -4.692024
H  4.66615 2.184968 -4.651024
H  1.146068 1.387946 -3.558039
H  1.444909 1.593883 -1.833072
H  1.373035 2.993353 -2.903765
H  0.516024 -1.896626 1.862701
H  0.422778 -3.243279 0.738112
H  -2.29271 -1.520324 1.681536
H  -0.001725 -0.979994 -1.945528
H  -4.708583 -0.888579 -0.953924
H  -4.131157 0.760586 -0.879028
H  -6.013177 -1.746402 0.829564
H  -3.559611 1.69086 1.510905
H  -7.010722 -1.478391 3.066198
H  -4.554735 1.961091 3.745114
H  -6.288824 0.378343 4.534922
elementType: O C H
totalener: -1079.75228487 hartree
nucrepener: 2081.21065860 hartree
electener: -3160.96294347 hartree
oneelecener: -5601.62818390 hartree
twoeener: 2440.66524043 hartree
cpcmener: -0.02487284 hartree
kineticenergy: 1074.85230934 hartree
xcener: -106.461910062305 hartree
chargesum: 0.0000000
charge: -0.291867 -0.468123 -0.284511 0.155455 -0.035169 -0.060123 -0.295639 -0.273186 -0.282262 0.347873 -0.004482 -0.229822 -0.255627 0.115833 -0.050851 -0.319795 -0.065843 0.187758 -0.015172 -0.002383 -0.172154 -0.204726 -0.155416 -0.144905 -0.169348 0.100455 0.089817 0.101230 0.090131 0.098630 0.098574 0.092982 0.093723 0.122953 0.094276 0.094803 0.088281 0.096054 0.076159 0.103328 0.112787 0.117582 0.162300 0.177786 0.099270 0.110876 0.138709 0.143429 0.155754 0.157019 0.157577
qa: -0.2919 -0.4681 -0.2845 0.1555 -0.0352 -0.0601 -0.2956 -0.2732 -0.2823 0.3479 -0.0045 -0.2298 -0.2556 0.1158 -0.0509 -0.3198 -0.0658 0.1878 -0.0152 -0.0024 -0.1722 -0.2047 -0.1554 -0.1449 -0.1693 0.1005 0.0898 0.1012 0.0901 0.0986 0.0986 0.0930 0.0937 0.1230 0.0943 0.0948 0.0883 0.0961 0.0762 0.1033 0.1128 0.1176 0.1623 0.1778 0.0993 0.1109 0.1387 0.1434 0.1558 0.1570 0.1576
va: 2.1167 2.0262 2.2677 3.7267 3.8207 3.7842 3.9158 3.8822 3.8908 4.1866 3.6935 3.9298 3.9494 3.8149 3.6728 3.9877 3.9424 3.6655 3.8022 3.6327 3.9201 3.9362 3.8981 3.8861 3.8971 1.0254 1.0335 0.9984 1.0011 1.0026 0.9995 1.0188 1.0009 1.0037 0.9966 0.9955 1.0070 0.9972 1.0129 1.0002 1.0131 0.9911 1.0010 0.9920 1.0068 1.0069 1.0045 1.0016 0.9913 0.9907 0.9903
dispcorr: -0.023210216 hartree
energy: -1079.775495084649
dipole: 21.39041 -21.24355 0.14686 8.69664 -9.24237 -0.54573 -8.69715 8.13988 -0.55728
magnitude: 0.79369 au
magnitude: 2.01741 debye
