program: Orca
programVersion: 5.0.2
elementType: O O O C C C C C C C C C C C C C C C C C C C C C C H H H H H H H H H H H H H H H H H H H H H H H H H H
charge: 0
multiplicity: 1
keywords: wb97x-d3
keywords: def2-TZVPP
keywords: def2/J RIJCOSX
keywords: DEFGRID2
keywords: scfconv7
keywords: smallprint printgap noloewdin
keywords: NOSOSCF
formula: C22H26O3
InChI: InChI=1/C22H26O3/c1-15(2)10-19-20(22(19,3)4)21(23)25-14-17-12-18(24-13-17)11-16-8-6-5-7-9-16/h5-10,12-13,19-20H,11,14H2,1-4H3
51 atoms
O  1.285793 -1.934343 -0.83181
O  2.161874 -1.196921 1.088259
O  -2.213586 -1.91921 1.831174
C  4.089738 0.167388 -1.053377
C  3.251067 1.175511 -0.323047
C  2.583579 -0.01985 -0.952891
C  4.623377 0.517481 -2.420385
C  5.02201 -0.710624 -0.256797
C  2.98789 2.528615 -0.869309
C  2.005884 -1.082861 -0.104984
C  3.52581 3.664169 -0.415287
C  3.176058 4.987511 -1.025948
C  4.509427 3.732885 0.712453
C  0.658007 -3.035495 -0.152398
C  -0.654798 -2.649242 0.431757
C  -1.930831 -2.700053 -0.217174
C  -0.897633 -2.166597 1.674259
C  -2.840814 -2.250336 0.677935
C  -4.307387 -2.024502 0.604051
C  -4.645545 -0.556776 0.487305
C  -4.52451 0.092182 -0.739212
C  -5.04786 0.177081 1.598055
C  -4.80491 1.445364 -0.854868
C  -5.328126 1.533457 1.485797
C  -5.207134 2.171439 0.259613
H  3.338204 1.118136 0.757826
H  2.045637 0.153223 -1.879518
H  5.532911 1.115842 -2.332316
H  3.911675 1.08661 -3.017771
H  4.875781 -0.386177 -2.978813
H  4.682755 -0.882676 0.762973
H  6.006407 -0.241959 -0.195183
H  5.153393 -1.683087 -0.736562
H  2.298237 2.589032 -1.706836
H  2.750847 5.663699 -0.27919
H  4.065302 5.486422 -1.420698
H  2.456121 4.890631 -1.83872
H  4.128253 4.357597 1.524843
H  4.763314 2.760111 1.130227
H  5.439755 4.200186 0.37844
H  1.326973 -3.447463 0.603289
H  0.520698 -3.791374 -0.92398
H  -2.136271 -3.036887 -1.221676
H  -0.262061 -1.963795 2.521821
H  -4.798711 -2.4528 1.481598
H  -4.685331 -2.565696 -0.264899
H  -4.20981 -0.468149 -1.612488
H  -5.14871 -0.314641 2.558624
H  -4.711395 1.934036 -1.816557
H  -5.642933 2.091182 2.358846
H  -5.427815 3.227494 0.170306
elementType: O C H
totalener: -1079.75420173 hartree
nucrepener: 2059.78903550 hartree
electener: -3139.54323723 hartree
oneelecener: -5559.07775185 hartree
twoeener: 2419.53451462 hartree
cpcmener: -0.02532011 hartree
kineticenergy: 1074.85792490 hartree
xcener: -106.458700071587 hartree
chargesum: -0.0000000
charge: -0.283240 -0.476492 -0.276722 0.141143 0.002811 -0.130023 -0.263181 -0.290190 -0.269929 0.409160 -0.031093 -0.228883 -0.251781 0.089093 -0.084461 -0.332651 -0.013200 0.203263 -0.066385 0.052915 -0.195869 -0.195137 -0.156778 -0.153453 -0.172768 0.092815 0.089928 0.095481 0.089305 0.097299 0.092401 0.095815 0.100031 0.119516 0.094092 0.092867 0.088992 0.097145 0.088140 0.095084 0.118881 0.119426 0.160564 0.168423 0.110596 0.115436 0.142075 0.139025 0.156512 0.156604 0.157399
qa: -0.2832 -0.4765 -0.2767 0.1411 0.0028 -0.1300 -0.2632 -0.2902 -0.2699 0.4092 -0.0311 -0.2289 -0.2518 0.0891 -0.0845 -0.3327 -0.0132 0.2033 -0.0664 0.0529 -0.1959 -0.1951 -0.1568 -0.1535 -0.1728 0.0928 0.0899 0.0955 0.0893 0.0973 0.0924 0.0958 0.1000 0.1195 0.0941 0.0929 0.0890 0.0971 0.0881 0.0951 0.1189 0.1194 0.1606 0.1684 0.1106 0.1154 0.1421 0.1390 0.1565 0.1566 0.1574
va: 2.1250 2.0281 2.2843 3.6830 3.7704 3.8892 3.9046 3.9031 3.8722 4.1920 3.7107 3.9272 3.9437 3.8010 3.6303 4.0244 3.9487 3.6283 3.8219 3.5826 3.9443 3.9601 3.9062 3.8962 3.9022 1.0302 1.0375 1.0031 1.0033 1.0031 1.0182 1.0011 0.9996 1.0082 0.9955 0.9964 1.0081 0.9980 1.0086 0.9975 1.0133 0.9961 1.0068 1.0062 1.0093 1.0073 1.0033 1.0058 0.9913 0.9908 0.9906
dispcorr: -0.021975443 hartree
energy: -1079.776177173745
dipole: 24.58734 -24.56695 0.02039 18.24902 -18.28945 -0.04043 -8.02211 6.93173 -1.09038
magnitude: 1.09132 au
magnitude: 2.77390 debye
