program: Orca
programVersion: 5.0.2
elementType: O O O C C C C C C C C C C C C C C C C C C C C C C H H H H H H H H H H H H H H H H H H H H H H H H H H
charge: 0
multiplicity: 1
keywords: wb97x-d3
keywords: def2-TZVPP
keywords: def2/J RIJCOSX
keywords: DEFGRID2
keywords: scfconv7
keywords: smallprint printgap noloewdin
keywords: NOSOSCF
formula: C22H26O3
InChI: InChI=1/C22H26O3/c1-15(2)10-19-20(22(19,3)4)21(23)25-14-17-12-18(24-13-17)11-16-8-6-5-7-9-16/h5-10,12-13,19-20H,11,14H2,1-4H3
51 atoms
O  1.566932 -1.713229 -0.266074
O  2.088358 -0.151493 1.247732
O  -1.832828 0.66307 -0.836069
C  4.877846 -0.167003 -0.202441
C  4.042164 0.948776 -0.725423
C  3.467208 -0.463719 -0.684943
C  5.975607 -0.738726 -1.067953
C  5.21352 -0.200616 1.268732
C  4.280976 1.615684 -2.027674
C  2.336866 -0.732437 0.218003
C  3.405909 2.419594 -2.639258
C  3.734669 3.085409 -3.940333
C  2.041733 2.723017 -2.100517
C  0.350735 -2.004128 0.417078
C  -0.699938 -0.99257 0.109167
C  -1.952001 -0.835401 0.785591
C  -0.686926 -0.056765 -0.86749
C  -2.596452 0.185422 0.169295
C  -3.896064 0.870043 0.412937
C  -4.854465 0.007203 1.188273
C  -5.493414 -1.062269 0.563536
C  -5.115393 0.250378 2.532083
C  -6.378022 -1.866202 1.265682
C  -5.999565 -0.555339 3.240151
C  -6.635182 -1.613749 2.608114
H  3.629053 1.589573 0.048715
H  3.412927 -0.980491 -1.636314
H  6.214153 -1.757099 -0.754997
H  6.88787 -0.145255 -0.977318
H  5.706895 -0.777558 -2.123496
H  5.31323 -1.227378 1.626758
H  4.475449 0.302007 1.889625
H  6.171309 0.297009 1.434849
H  5.24189 1.445468 -2.504418
H  3.020225 2.802403 -4.718032
H  3.675872 4.173564 -3.850645
H  4.73417 2.831297 -4.293493
H  1.811089 2.198799 -1.174043
H  1.927204 3.794612 -1.915049
H  1.274137 2.458192 -2.832809
H  0.510851 -2.08679 1.494512
H  0.053945 -2.991225 0.059519
H  -2.312751 -1.409228 1.62508
H  0.025359 0.206417 -1.634057
H  -4.340212 1.146975 -0.547527
H  -3.722969 1.808105 0.950053
H  -5.297844 -1.264641 -0.483476
H  -4.624948 1.077617 3.031965
H  -6.87157 -2.689063 0.764092
H  -6.195544 -0.349721 4.28499
H  -7.329855 -2.237971 3.155635
elementType: O C H
totalener: -1079.75217318 hartree
nucrepener: 2069.72108712 hartree
electener: -3149.47326031 hartree
oneelecener: -5578.52766629 hartree
twoeener: 2429.05440598 hartree
cpcmener: -0.02520102 hartree
kineticenergy: 1074.84688510 hartree
xcener: -106.461281915618 hartree
chargesum: 0.0000000
charge: -0.293977 -0.467822 -0.285050 0.155945 -0.038708 -0.063536 -0.292878 -0.274606 -0.273833 0.349364 -0.002000 -0.231100 -0.268331 0.112165 -0.051111 -0.326230 -0.065228 0.188616 -0.013812 -0.002691 -0.201466 -0.173656 -0.145920 -0.153984 -0.168581 0.101571 0.091055 0.098251 0.101450 0.088760 0.098425 0.093492 0.093797 0.122310 0.094185 0.094659 0.088805 0.079174 0.104826 0.097055 0.112973 0.120124 0.163114 0.184766 0.109725 0.099464 0.141589 0.138759 0.156421 0.156175 0.157504
qa: -0.2940 -0.4678 -0.2850 0.1559 -0.0387 -0.0635 -0.2929 -0.2746 -0.2738 0.3494 -0.0020 -0.2311 -0.2683 0.1122 -0.0511 -0.3262 -0.0652 0.1886 -0.0138 -0.0027 -0.2015 -0.1737 -0.1459 -0.1540 -0.1686 0.1016 0.0911 0.0983 0.1014 0.0888 0.0984 0.0935 0.0938 0.1223 0.0942 0.0947 0.0888 0.0792 0.1048 0.0971 0.1130 0.1201 0.1631 0.1848 0.1097 0.0995 0.1416 0.1388 0.1564 0.1562 0.1575
va: 2.1149 2.0255 2.2684 3.7343 3.8234 3.7923 3.9168 3.8816 3.8892 4.1815 3.6851 3.9308 3.9528 3.8189 3.6824 3.9880 3.9468 3.6647 3.7987 3.6379 3.9347 3.9196 3.8879 3.8962 3.8962 1.0235 1.0337 1.0025 0.9986 1.0014 0.9997 1.0193 1.0008 1.0045 0.9965 0.9957 1.0071 1.0118 1.0008 0.9956 1.0124 0.9914 1.0010 0.9854 1.0079 1.0052 1.0026 1.0045 0.9908 0.9912 0.9904
dispcorr: -0.023202508 hartree
energy: -1079.775375688239
dipole: 22.13532 -22.15478 -0.01947 7.77193 -8.14234 -0.37041 -8.47694 7.77065 -0.70630
magnitude: 0.79777 au
magnitude: 2.02777 debye
