program: Orca
programVersion: 5.0.2
elementType: O O O C C C C C C C C C C C C C C C C C C C C C C H H H H H H H H H H H H H H H H H H H H H H H H H H
charge: 0
multiplicity: 1
keywords: wb97x-d3
keywords: def2-TZVPP
keywords: def2/J RIJCOSX
keywords: DEFGRID2
keywords: scfconv7
keywords: smallprint printgap noloewdin
keywords: NOSOSCF
formula: C22H26O3
InChI: InChI=1/C22H26O3/c1-15(2)10-19-20(22(19,3)4)21(23)25-14-17-12-18(24-13-17)11-16-8-6-5-7-9-16/h5-10,12-13,19-20H,11,14H2,1-4H3
51 atoms
O  1.475058 -1.545039 0.199967
O  1.362716 -0.95291 -1.95304
O  -2.825875 -1.753788 -0.620565
C  2.143285 1.852335 -0.763394
C  3.325307 1.22059 -1.412361
C  2.532237 0.428234 -0.38842
C  2.362486 2.878933 0.32199
C  0.907145 2.119031 -1.586644
C  4.718705 1.644908 -1.119573
C  1.735616 -0.732543 -0.823203
C  5.79624 0.86463 -1.236506
C  7.173018 1.388133 -0.963565
C  5.73079 -0.573297 -1.64838
C  0.668031 -2.706582 -0.055427
C  -0.783088 -2.378001 -0.020708
C  -1.632911 -2.376174 1.132685
C  -1.570707 -1.989705 -1.052512
C  -2.86042 -1.992781 0.711696
C  -4.144568 -1.76328 1.420854
C  -4.457956 -0.294287 1.586215
C  -5.5238 0.293126 0.914635
C  -3.669296 0.498476 2.417729
C  -5.801277 1.646108 1.071604
C  -3.94411 1.847702 2.57759
C  -5.012775 2.427026 1.903424
H  3.151408 0.892133 -2.434215
H  2.980654 0.324674 0.59331
H  1.485619 2.942257 0.969352
H  2.524196 3.869183 -0.109705
H  3.219864 2.647739 0.954234
H  0.003693 2.042945 -0.977889
H  0.800059 1.443955 -2.432748
H  0.948078 3.134715 -1.985871
H  4.863289 2.678953 -0.818586
H  7.66002 0.817207 -0.168389
H  7.811699 1.292726 -1.845846
H  7.164041 2.437294 -0.667641
H  4.714634 -0.932057 -1.805376
H  6.287704 -0.734909 -2.57549
H  6.19904 -1.213088 -0.89561
H  0.91917 -3.398648 0.746854
H  0.954594 -3.171633 -0.998904
H  -1.357664 -2.634977 2.143601
H  -1.387555 -1.853008 -2.106685
H  -4.072437 -2.23989 2.400529
H  -4.961692 -2.25923 0.890767
H  -6.146101 -0.310801 0.264473
H  -2.83284 0.054937 2.946368
H  -6.63658 2.088019 0.543146
H  -3.3249 2.448866 3.231489
H  -5.229197 3.480227 2.029307
elementType: O C H
totalener: -1079.75363236 hartree
nucrepener: 2086.18245099 hartree
electener: -3165.93608335 hartree
oneelecener: -5611.76402084 hartree
twoeener: 2445.82793749 hartree
cpcmener: -0.02401736 hartree
kineticenergy: 1074.86018873 hartree
xcener: -106.459879409774 hartree
chargesum: -0.0000000
charge: -0.285438 -0.480535 -0.276284 0.153154 -0.035053 -0.097234 -0.292066 -0.277953 -0.282568 0.395633 -0.013289 -0.227322 -0.243725 0.091255 -0.086937 -0.326339 -0.015952 0.207151 -0.063468 0.032881 -0.188587 -0.188622 -0.151944 -0.159367 -0.170951 0.101791 0.091335 0.098314 0.098699 0.091856 0.099173 0.093165 0.094774 0.121927 0.093893 0.094826 0.088383 0.080348 0.100436 0.095746 0.117175 0.118878 0.161258 0.168137 0.118078 0.105655 0.138411 0.142206 0.156075 0.155809 0.157213
qa: -0.2854 -0.4805 -0.2763 0.1532 -0.0351 -0.0972 -0.2921 -0.2780 -0.2826 0.3956 -0.0133 -0.2273 -0.2437 0.0913 -0.0869 -0.3263 -0.0160 0.2072 -0.0635 0.0329 -0.1886 -0.1886 -0.1519 -0.1594 -0.1710 0.1018 0.0913 0.0983 0.0987 0.0919 0.0992 0.0932 0.0948 0.1219 0.0939 0.0948 0.0884 0.0803 0.1004 0.0957 0.1172 0.1189 0.1613 0.1681 0.1181 0.1057 0.1384 0.1422 0.1561 0.1558 0.1572
va: 2.1210 2.0199 2.2817 3.7057 3.8326 3.8147 3.9121 3.8873 3.8805 4.1552 3.7057 3.9298 3.9403 3.8080 3.6386 4.0142 3.9465 3.6203 3.8239 3.6169 3.9504 3.9363 3.8938 3.9116 3.9011 1.0262 1.0323 1.0028 0.9994 1.0016 0.9995 1.0186 1.0018 1.0028 0.9967 0.9959 1.0069 1.0152 0.9987 0.9989 0.9957 1.0120 1.0063 1.0075 1.0049 1.0114 1.0043 1.0038 0.9912 0.9920 0.9906
dispcorr: -0.022714479 hartree
energy: -1079.776346837608
dipole: 24.26228 -23.89466 0.36763 13.10094 -13.16223 -0.06128 -1.70976 2.84084 1.13108
magnitude: 1.19090 au
magnitude: 3.02703 debye
