program: Orca
programVersion: 5.0.2
elementType: O O O C C C C C C C C C C C C C C C C C C C C C C H H H H H H H H H H H H H H H H H H H H H H H H H H
charge: 0
multiplicity: 1
keywords: wb97x-d3
keywords: def2-TZVPP
keywords: def2/J RIJCOSX
keywords: DEFGRID2
keywords: scfconv7
keywords: smallprint printgap noloewdin
keywords: NOSOSCF
formula: C22H26O3
InChI: InChI=1/C22H26O3/c1-15(2)10-19-20(22(19,3)4)21(23)25-14-17-12-18(24-13-17)11-16-8-6-5-7-9-16/h5-10,12-13,19-20H,11,14H2,1-4H3
51 atoms
O  1.516747 -1.584733 0.253743
O  1.377575 -1.033339 -1.908142
O  -2.774174 -1.89424 -0.576107
C  2.019859 1.82128 -0.725674
C  3.212077 1.252649 -1.414958
C  2.497008 0.41822 -0.371344
C  2.223005 2.854831 0.356125
C  0.745365 2.025441 -1.506713
C  4.587848 1.75687 -1.164921
C  1.745274 -0.780471 -0.783635
C  5.69606 1.01193 -1.18439
C  7.046785 1.616687 -0.950898
C  5.693723 -0.464276 -1.435997
C  0.733473 -2.767504 0.021657
C  -0.721845 -2.45992 0.047201
C  -1.56055 -2.381586 1.205879
C  -1.520849 -2.150356 -1.001869
C  -2.794205 -2.03642 0.77027
C  -4.070511 -1.753733 1.474094
C  -4.377725 -0.274853 1.524549
C  -3.602237 0.571539 2.314478
C  -5.419617 0.268909 0.782418
C  -3.867952 1.931122 2.366341
C  -5.687752 1.632037 0.830815
C  -4.913961 2.466327 1.623729
H  3.022336 0.922486 -2.433839
H  2.979351 0.336054 0.596311
H  2.312899 3.854292 -0.075319
H  3.116691 2.668769 0.952123
H  1.370071 2.867293 1.037638
H  -0.132557 1.90811 -0.867793
H  0.641893 1.343961 -2.348326
H  0.723053 3.040736 -1.908588
H  4.688886 2.823705 -0.983359
H  7.702865 1.457446 -1.810713
H  6.991716 2.689264 -0.76405
H  7.542993 1.150848 -0.095032
H  6.328957 -0.709416 -2.291319
H  6.110852 -1.003822 -0.58114
H  4.701858 -0.867516 -1.6337
H  0.996674 -3.43729 0.838882
H  1.029177 -3.247035 -0.911781
H  -1.273998 -2.564221 2.230165
H  -1.347091 -2.087063 -2.064617
H  -3.986252 -2.150841 2.487441
H  -4.893959 -2.288751 0.994063
H  -2.783885 0.161457 2.895809
H  -6.030974 -0.377138 0.163124
H  -3.260073 2.574712 2.989827
H  -6.503773 2.040273 0.247911
H  -5.123019 3.527715 1.66469
elementType: O C H
totalener: -1079.75360524 hartree
nucrepener: 2097.33600719 hartree
electener: -3177.08961243 hartree
oneelecener: -5634.09028110 hartree
twoeener: 2457.00066867 hartree
cpcmener: -0.02410033 hartree
kineticenergy: 1074.86119045 hartree
xcener: -106.459971228865 hartree
chargesum: -0.0000000
charge: -0.285413 -0.478476 -0.276443 0.149309 -0.022504 -0.106222 -0.288526 -0.278082 -0.288482 0.393797 -0.015941 -0.227675 -0.241299 0.090179 -0.085424 -0.328761 -0.015977 0.206662 -0.063979 0.038351 -0.192279 -0.189456 -0.159776 -0.152590 -0.170246 0.102604 0.093488 0.098227 0.092304 0.097855 0.098263 0.092147 0.094986 0.120989 0.095114 0.089009 0.093571 0.100058 0.097353 0.081687 0.117746 0.118541 0.161330 0.168879 0.118062 0.106117 0.142349 0.138498 0.155913 0.156572 0.157589
qa: -0.2854 -0.4785 -0.2764 0.1493 -0.0225 -0.1062 -0.2885 -0.2781 -0.2885 0.3938 -0.0159 -0.2277 -0.2413 0.0902 -0.0854 -0.3288 -0.0160 0.2067 -0.0640 0.0384 -0.1923 -0.1895 -0.1598 -0.1526 -0.1702 0.1026 0.0935 0.0982 0.0923 0.0979 0.0983 0.0921 0.0950 0.1210 0.0951 0.0890 0.0936 0.1001 0.0974 0.0817 0.1177 0.1185 0.1613 0.1689 0.1181 0.1061 0.1423 0.1385 0.1559 0.1566 0.1576
va: 2.1197 2.0227 2.2804 3.7037 3.8185 3.8150 3.9085 3.8919 3.8835 4.1595 3.7094 3.9306 3.9368 3.8118 3.6377 4.0131 3.9449 3.6212 3.8238 3.6059 3.9382 3.9529 3.9117 3.8948 3.9006 1.0268 1.0308 0.9998 1.0022 1.0030 0.9997 1.0185 1.0018 1.0034 0.9963 1.0066 0.9966 0.9994 0.9987 1.0148 0.9949 1.0121 1.0064 1.0066 1.0053 1.0112 1.0037 1.0046 0.9919 0.9910 0.9905
dispcorr: -0.023018949 hartree
energy: -1079.776624193411
dipole: 23.45919 -23.10838 0.35081 13.85655 -13.85505 0.00149 -1.31139 2.47814 1.16676
magnitude: 1.21836 au
magnitude: 3.09682 debye
