program: Orca
programVersion: 5.0.2
elementType: O O O C C C C C C C C C C C C C C C C C C C C C C H H H H H H H H H H H H H H H H H H H H H H H H H H
charge: 0
multiplicity: 1
keywords: wb97x-d3
keywords: def2-TZVPP
keywords: def2/J RIJCOSX
keywords: DEFGRID2
keywords: scfconv7
keywords: smallprint printgap noloewdin
keywords: NOSOSCF
formula: C22H26O3
InChI: InChI=1/C22H26O3/c1-15(2)10-19-20(22(19,3)4)21(23)25-14-17-12-18(24-13-17)11-16-8-6-5-7-9-16/h5-10,12-13,19-20H,11,14H2,1-4H3
51 atoms
O  1.513219 -1.722459 0.032246
O  1.180119 -0.863516 -2.005423
O  -2.838638 -1.922275 -0.498449
C  1.935136 1.807868 -0.525566
C  3.087399 1.326851 -1.33779
C  2.415338 0.370374 -0.369812
C  2.196629 2.69834 0.665193
C  0.628012 2.114005 -1.215078
C  4.481008 1.781228 -1.095949
C  1.641319 -0.769601 -0.891054
C  5.575913 1.075819 -1.391857
C  6.94757 1.626565 -1.147906
C  5.535196 -0.300051 -1.981509
C  0.694234 -2.859842 -0.285624
C  -0.745016 -2.53703 -0.101527
C  -1.449868 -2.441484 1.142126
C  -1.644666 -2.205008 -1.056939
C  -2.714343 -2.065188 0.842601
C  -3.89753 -1.74256 1.678932
C  -4.194839 -0.260705 1.690549
C  -5.33461 0.247452 1.078788
C  -3.311994 0.624889 2.305934
C  -5.594193 1.613033 1.086323
C  -3.56819 1.987301 2.3159
C  -4.712216 2.486669 1.704602
H  2.845464 1.121523 -2.378037
H  2.945869 0.168726 0.553975
H  1.372452 2.632648 1.378307
H  2.279666 3.742719 0.356033
H  3.111427 2.436223 1.19714
H  -0.221363 1.926483 -0.554599
H  0.478091 1.53925 -2.126159
H  0.600698 3.170531 -1.490141
H  4.607574 2.774322 -0.673639
H  7.513206 0.984608 -0.4672
H  7.523585 1.674242 -2.07599
H  6.919064 2.628592 -0.719479
H  6.052815 -0.323381 -2.944298
H  6.057458 -1.012015 -1.336541
H  4.524244 -0.672956 -2.138835
H  1.011267 -3.630458 0.415657
H  0.901941 -3.218815 -1.294141
H  -1.057145 -2.628823 2.129739
H  -1.58246 -2.139406 -2.132025
H  -3.692831 -2.09137 2.693027
H  -4.773413 -2.294285 1.327447
H  -6.029842 -0.428622 0.594848
H  -2.41621 0.244255 2.783974
H  -6.487743 1.992506 0.606879
H  -2.874752 2.661555 2.802696
H  -4.913351 3.550342 1.712032
elementType: O C H
totalener: -1079.75371390 hartree
nucrepener: 2107.40538325 hartree
electener: -3187.15909715 hartree
oneelecener: -5654.26061060 hartree
twoeener: 2467.10151346 hartree
cpcmener: -0.02448592 hartree
kineticenergy: 1074.86349217 hartree
xcener: -106.460394337589 hartree
chargesum: -0.0000000
charge: -0.286324 -0.478294 -0.276989 0.152593 -0.034132 -0.097476 -0.291579 -0.274700 -0.282925 0.393207 -0.013477 -0.227388 -0.243877 0.091618 -0.086316 -0.331532 -0.014902 0.206449 -0.063152 0.036256 -0.186820 -0.192100 -0.154002 -0.162792 -0.168053 0.101627 0.091051 0.097783 0.098570 0.092356 0.097288 0.092506 0.094994 0.122317 0.093876 0.094836 0.088464 0.100311 0.096274 0.080572 0.118868 0.116943 0.161355 0.170041 0.117359 0.107160 0.139476 0.142138 0.156127 0.157085 0.157332
qa: -0.2863 -0.4783 -0.2770 0.1526 -0.0341 -0.0975 -0.2916 -0.2747 -0.2829 0.3932 -0.0135 -0.2274 -0.2439 0.0916 -0.0863 -0.3315 -0.0149 0.2064 -0.0632 0.0363 -0.1868 -0.1921 -0.1540 -0.1628 -0.1681 0.1016 0.0911 0.0978 0.0986 0.0924 0.0973 0.0925 0.0950 0.1223 0.0939 0.0948 0.0885 0.1003 0.0963 0.0806 0.1189 0.1169 0.1614 0.1700 0.1174 0.1072 0.1395 0.1421 0.1561 0.1571 0.1573
va: 2.1169 2.0234 2.2782 3.7055 3.8321 3.8166 3.9113 3.8868 3.8829 4.1591 3.7058 3.9301 3.9403 3.8246 3.6384 4.0060 3.9481 3.6173 3.8246 3.6062 3.9492 3.9334 3.8967 3.9085 3.8983 1.0263 1.0324 1.0031 0.9993 1.0015 0.9996 1.0194 1.0017 1.0027 0.9965 0.9961 1.0068 0.9989 0.9986 1.0153 0.9934 1.0118 1.0070 1.0042 1.0057 1.0097 1.0041 1.0038 0.9911 0.9915 0.9905
dispcorr: -0.023161830 hartree
energy: -1079.776875731256
dipole: 23.29749 -22.84620 0.45129 13.98529 -14.08217 -0.09688 -1.41859 2.54209 1.12349
magnitude: 1.21461 au
magnitude: 3.08730 debye
