program: Orca
programVersion: 5.0.2
elementType: O O O C C C C C C C C C C C C C C C C C C C C C C H H H H H H H H H H H H H H H H H H H H H H H H H H
charge: 0
multiplicity: 1
keywords: wb97x-d3
keywords: def2-TZVPP
keywords: def2/J RIJCOSX
keywords: DEFGRID2
keywords: scfconv7
keywords: smallprint printgap noloewdin
keywords: NOSOSCF
formula: C22H26O3
InChI: InChI=1/C22H26O3/c1-15(2)10-19-20(22(19,3)4)21(23)25-14-17-12-18(24-13-17)11-16-8-6-5-7-9-16/h5-10,12-13,19-20H,11,14H2,1-4H3
51 atoms
O  1.388168 -1.67218 -0.967768
O  2.329175 -1.202379 1.006262
O  -2.077239 0.123719 0.540569
C  4.699538 -0.30477 -0.896991
C  3.98493 0.882248 -0.326399
C  3.186474 -0.217866 -1.00191
C  5.453767 -0.172029 -2.198201
C  5.345057 -1.277193 0.059343
C  4.026357 2.222869 -0.940387
C  2.288671 -1.062264 -0.192482
C  4.125378 3.389643 -0.294313
C  4.125271 4.684867 -1.049353
C  4.222422 3.538461 1.194425
C  0.377848 -2.455281 -0.336548
C  -0.728203 -1.598402 0.174652
C  -1.800349 -2.014194 1.027729
C  -0.952625 -0.290978 -0.089296
C  -2.586297 -0.926978 1.215709
C  -3.851603 -0.71035 1.964974
C  -5.017025 -0.447535 1.041209
C  -5.832144 -1.492823 0.616333
C  -5.273912 0.836997 0.56938
C  -6.884114 -1.260914 -0.259302
C  -6.322363 1.071228 -0.309698
C  -7.131308 0.022754 -0.727029
H  3.910207 0.86584 0.755424
H  2.817027 -0.000614 -1.998288
H  6.444296 0.254046 -2.025371
H  4.943973 0.459669 -2.924572
H  5.592576 -1.151751 -2.659773
H  5.331901 -2.292561 -0.342868
H  4.870699 -1.297115 1.038223
H  6.390293 -0.999892 0.21155
H  3.951914 2.255343 -2.023494
H  5.051077 5.240595 -0.877246
H  4.015919 4.53869 -2.12411
H  3.31136 5.334185 -0.714631
H  4.434201 2.608084 1.717572
H  5.009028 4.248983 1.458233
H  3.292804 3.943467 1.603748
H  0.795221 -3.075259 0.459674
H  0.01517 -3.130141 -1.113363
H  -1.959819 -2.996301 1.445302
H  -0.429911 0.451882 -0.671226
H  -3.733286 0.123653 2.66269
H  -4.041562 -1.600284 2.566224
H  -5.645228 -2.498097 0.976264
H  -4.654602 1.664326 0.895542
H  -7.512081 -2.084409 -0.575357
H  -6.508634 2.076094 -0.667315
H  -7.950504 0.205044 -1.410811
elementType: O C H
totalener: -1079.75411529 hartree
nucrepener: 2036.91573313 hartree
electener: -3116.66984842 hartree
oneelecener: -5513.10707943 hartree
twoeener: 2396.43723101 hartree
cpcmener: -0.02718874 hartree
kineticenergy: 1074.85446512 hartree
xcener: -106.461875985506 hartree
chargesum: -0.0000000
charge: -0.290732 -0.465949 -0.283683 0.095706 0.050196 -0.086148 -0.272748 -0.271971 -0.283602 0.372072 -0.040965 -0.217259 -0.259234 0.109265 -0.031525 -0.349519 -0.056157 0.209222 -0.063870 0.067712 -0.206006 -0.199510 -0.147670 -0.157159 -0.175552 0.089850 0.088823 0.097841 0.088376 0.097136 0.097623 0.091340 0.095338 0.115447 0.092922 0.086970 0.092651 0.092335 0.092008 0.101011 0.113232 0.121379 0.160552 0.167593 0.116396 0.106383 0.139611 0.139637 0.157100 0.156228 0.157308
qa: -0.2907 -0.4659 -0.2837 0.0957 0.0502 -0.0861 -0.2727 -0.2720 -0.2836 0.3721 -0.0410 -0.2173 -0.2592 0.1093 -0.0315 -0.3495 -0.0562 0.2092 -0.0639 0.0677 -0.2060 -0.1995 -0.1477 -0.1572 -0.1756 0.0899 0.0888 0.0978 0.0884 0.0971 0.0976 0.0913 0.0953 0.1154 0.0929 0.0870 0.0927 0.0923 0.0920 0.1010 0.1132 0.1214 0.1606 0.1676 0.1164 0.1064 0.1396 0.1396 0.1571 0.1562 0.1573
va: 2.1180 2.0356 2.2757 3.7196 3.7606 3.8136 3.9112 3.9039 3.8911 4.1927 3.7573 3.9226 3.9417 3.8202 3.6302 4.0160 3.9526 3.6332 3.8283 3.5732 3.9504 3.9573 3.8886 3.8997 3.9053 1.0348 1.0353 1.0015 1.0064 1.0017 0.9999 1.0191 1.0002 1.0121 0.9966 1.0092 0.9954 1.0084 0.9981 0.9952 1.0136 0.9906 1.0054 0.9987 1.0038 1.0100 1.0042 1.0102 0.9905 0.9912 0.9906
dispcorr: -0.021590265 hartree
energy: -1079.775705550916
dipole: 26.07839 -26.01946 0.05893 12.41481 -12.52642 -0.11161 -3.75692 3.10901 -0.64792
magnitude: 0.66010 au
magnitude: 1.67783 debye
