program: Orca
programVersion: 5.0.2
elementType: O O O C C C C C C C C C C C C C C C C C C C C C C H H H H H H H H H H H H H H H H H H H H H H H H H H
charge: 0
multiplicity: 1
keywords: wb97x-d3
keywords: def2-TZVPP
keywords: def2/J RIJCOSX
keywords: DEFGRID2
keywords: scfconv7
keywords: smallprint printgap noloewdin
keywords: NOSOSCF
formula: C22H26O3
InChI: InChI=1/C22H26O3/c1-15(2)10-19-20(22(19,3)4)21(23)25-14-17-12-18(24-13-17)11-16-8-6-5-7-9-16/h5-10,12-13,19-20H,11,14H2,1-4H3
51 atoms
O  0.978618 -1.253157 -1.636873
O  0.766908 0.825341 -0.845379
O  -1.291724 -2.234486 1.77308
C  3.691224 0.187629 0.175525
C  3.721986 1.150372 -0.973605
C  2.941457 -0.143005 -1.104871
C  4.900143 -0.667142 0.470979
C  2.936723 0.58416 1.421005
C  4.915466 1.358735 -1.816442
C  1.468657 -0.103222 -1.167067
C  5.378127 2.530066 -2.266251
C  6.593707 2.587426 -3.14246
C  4.758035 3.864899 -1.981896
C  -0.441628 -1.387186 -1.691393
C  -1.026344 -1.616673 -0.339442
C  -2.350546 -1.277886 0.084918
C  -0.432379 -2.196512 0.728534
C  -2.455879 -1.677471 1.375794
C  -3.554429 -1.619879 2.379497
C  -4.661707 -0.696901 1.947936
C  -5.894128 -1.195086 1.540649
C  -4.461479 0.682466 1.942175
C  -6.909663 -0.334904 1.139478
C  -5.471016 1.543303 1.540227
C  -6.700761 1.036101 1.137254
H  3.094137 2.0225 -0.827988
H  3.396673 -0.92387 -1.704475
H  5.633479 -0.104792 1.052698
H  5.397722 -1.029058 -0.427773
H  4.613804 -1.541348 1.059133
H  2.519601 -0.291699 1.923437
H  2.122441 1.279397 1.228928
H  3.618096 1.069126 2.123256
H  5.456554 0.462518 -2.106455
H  6.36802 3.073918 -4.095571
H  7.386766 3.178772 -2.676748
H  6.99589 1.597511 -3.358834
H  5.518185 4.57592 -1.649147
H  4.318388 4.288318 -2.889321
H  3.980659 3.839061 -1.220765
H  -0.61527 -2.243427 -2.344234
H  -0.8993 -0.518073 -2.168287
H  -3.112788 -0.791053 -0.503004
H  0.553098 -2.600773 0.900808
H  -3.145313 -1.286738 3.338422
H  -3.953977 -2.624038 2.55193
H  -6.065132 -2.265325 1.540059
H  -3.505324 1.086426 2.254891
H  -7.864982 -0.739335 0.829541
H  -5.299368 2.612325 1.54287
H  -7.490814 1.707232 0.825253
elementType: O C H
totalener: -1079.75355086 hartree
nucrepener: 2050.66786467 hartree
electener: -3130.42141553 hartree
oneelecener: -5540.60399222 hartree
twoeener: 2410.18257669 hartree
cpcmener: -0.02591269 hartree
kineticenergy: 1074.84747998 hartree
xcener: -106.461569651292 hartree
chargesum: -0.0000000
charge: -0.289321 -0.463628 -0.282538 0.101183 0.039417 -0.082769 -0.271245 -0.274149 -0.278599 0.369220 -0.042738 -0.219200 -0.256680 0.113163 -0.052202 -0.314881 -0.064492 0.186988 -0.014004 0.001747 -0.176736 -0.208222 -0.153805 -0.144881 -0.169530 0.089611 0.089793 0.097400 0.088238 0.096703 0.092832 0.093947 0.098532 0.115632 0.092390 0.093270 0.087393 0.092385 0.099565 0.091623 0.116650 0.114321 0.162158 0.171617 0.110108 0.100044 0.139165 0.143621 0.155931 0.157243 0.157732
qa: -0.2893 -0.4636 -0.2825 0.1012 0.0394 -0.0828 -0.2712 -0.2741 -0.2786 0.3692 -0.0427 -0.2192 -0.2567 0.1132 -0.0522 -0.3149 -0.0645 0.1870 -0.0140 0.0017 -0.1767 -0.2082 -0.1538 -0.1449 -0.1695 0.0896 0.0898 0.0974 0.0882 0.0967 0.0928 0.0939 0.0985 0.1156 0.0924 0.0933 0.0874 0.0924 0.0996 0.0916 0.1167 0.1143 0.1622 0.1716 0.1101 0.1000 0.1392 0.1436 0.1559 0.1572 0.1577
va: 2.1227 2.0361 2.2708 3.6987 3.7835 3.8093 3.9076 3.8995 3.8841 4.2136 3.7577 3.9223 3.9416 3.8139 3.6622 3.9896 3.9506 3.6678 3.8076 3.6314 3.9250 3.9372 3.8972 3.8860 3.8985 1.0353 1.0352 1.0017 1.0063 1.0020 1.0022 1.0186 1.0010 1.0119 0.9955 0.9966 1.0092 0.9979 0.9956 1.0090 0.9914 1.0118 1.0012 0.9988 1.0066 1.0075 1.0045 1.0018 0.9913 0.9908 0.9904
dispcorr: -0.022279957 hartree
energy: -1079.775830817590
dipole: 27.24625 -26.84136 0.40489 12.74465 -13.23570 -0.49105 -4.56096 4.32049 -0.24046
magnitude: 0.68036 au
magnitude: 1.72934 debye
