program: Orca
programVersion: 5.0.2
elementType: O O O C C C C C C C C C C C C C C C C C C C C C C H H H H H H H H H H H H H H H H H H H H H H H H H H
charge: 0
multiplicity: 1
keywords: wb97x-d3
keywords: def2-TZVPP
keywords: def2/J RIJCOSX
keywords: DEFGRID2
keywords: scfconv7
keywords: smallprint printgap noloewdin
keywords: NOSOSCF
formula: C22H26O3
InChI: InChI=1/C22H26O3/c1-15(2)10-19-20(22(19,3)4)21(23)25-14-17-12-18(24-13-17)11-16-8-6-5-7-9-16/h5-10,12-13,19-20H,11,14H2,1-4H3
51 atoms
O  1.862173 -2.243651 0.347131
O  1.437751 -1.574657 -1.743912
O  -2.43693 -2.685511 -0.338246
C  1.325461 1.147214 -0.094254
C  2.455079 1.140304 -1.086838
C  2.300497 -0.021044 -0.141444
C  1.41308 2.039876 1.118554
C  -0.085575 0.988593 -0.606495
C  3.627668 2.034112 -0.949861
C  1.83077 -1.33319 -0.62755
C  3.974081 3.009235 -1.795859
C  5.198751 3.839618 -1.555862
C  3.201999 3.372464 -3.027165
C  1.108484 -3.451483 0.146968
C  -0.342349 -3.138629 0.229798
C  -1.035758 -2.62159 1.372064
C  -1.247357 -3.146466 -0.775602
C  -2.300739 -2.359269 0.968965
C  -3.457561 -1.708595 1.640669
C  -3.429902 -0.21255 1.426999
C  -2.833897 0.620739 2.369562
C  -3.941422 0.352054 0.261666
C  -2.751758 1.989999 2.155583
C  -3.860194 1.721076 0.044852
C  -3.264604 2.544732 0.991054
H  2.141951 0.931707 -2.105073
H  2.986737 -0.068136 0.698378
H  0.759541 1.672311 1.91274
H  1.090058 3.053448 0.869942
H  2.421841 2.105465 1.525374
H  -0.149103 0.400861 -1.520318
H  -0.50839 1.971467 -0.824291
H  -0.725066 0.515609 0.142765
H  4.256355 1.872018 -0.07861
H  5.739347 3.53014 -0.661154
H  5.887904 3.779051 -2.402717
H  4.941255 4.896596 -1.444341
H  2.911637 4.426307 -2.997529
H  3.816532 3.249488 -3.923302
H  2.294202 2.787349 -3.162434
H  1.4255 -4.108923 0.955401
H  1.367945 -3.93019 -0.798351
H  -0.633831 -2.45355 2.359533
H  -1.19009 -3.445166 -1.810832
H  -3.409927 -1.931975 2.70731
H  -4.394124 -2.130479 1.268485
H  -2.428219 0.1950 3.280229
H  -4.41003 -0.281104 -0.482956
H  -2.287446 2.623742 2.900779
H  -4.265008 2.145638 -0.865215
H  -3.202296 3.612299 0.822672
elementType: O C H
totalener: -1079.75254032 hartree
nucrepener: 2193.42314743 hartree
electener: -3273.17568775 hartree
oneelecener: -5826.39098598 hartree
twoeener: 2553.21529823 hartree
cpcmener: -0.02551656 hartree
kineticenergy: 1074.85829439 hartree
xcener: -106.461381749597 hartree
chargesum: 0.0000000
charge: -0.283945 -0.456398 -0.273062 0.196066 0.008504 -0.116675 -0.278036 -0.282978 -0.282272 0.363843 -0.032275 -0.225992 -0.253347 0.092576 -0.057938 -0.348797 -0.029367 0.212112 -0.062416 0.041967 -0.169618 -0.187131 -0.170548 -0.154747 -0.170333 0.092490 0.091922 0.093475 0.097244 0.092174 0.100615 0.105041 0.046694 0.117715 0.088623 0.093181 0.093275 0.094234 0.096494 0.089814 0.120400 0.115538 0.157261 0.171656 0.108589 0.112502 0.136419 0.137787 0.156249 0.155240 0.156180
qa: -0.2839 -0.4564 -0.2731 0.1961 0.0085 -0.1167 -0.2780 -0.2830 -0.2823 0.3638 -0.0323 -0.2260 -0.2533 0.0926 -0.0579 -0.3488 -0.0294 0.2121 -0.0624 0.0420 -0.1696 -0.1871 -0.1705 -0.1547 -0.1703 0.0925 0.0919 0.0935 0.0972 0.0922 0.1006 0.1050 0.0467 0.1177 0.0886 0.0932 0.0933 0.0942 0.0965 0.0898 0.1204 0.1155 0.1573 0.1717 0.1086 0.1125 0.1364 0.1378 0.1562 0.1552 0.1562
va: 2.1058 2.0495 2.2713 3.6122 3.7971 3.8610 3.9033 3.9061 3.8743 4.2486 3.7281 3.9251 3.9441 3.8421 3.6356 3.9712 3.9523 3.6055 3.8166 3.6000 3.8788 3.9295 3.8655 3.8884 3.8603 1.0303 1.0369 1.0042 1.0025 1.0060 1.0243 1.0003 1.0105 1.0088 1.0084 0.9956 0.9964 0.9976 0.9972 1.0090 0.9917 1.0090 1.0111 0.9995 1.0108 1.0129 1.0044 1.0102 0.9916 0.9916 0.9916
dispcorr: -0.027241413 hartree
energy: -1079.779781733910
dipole: 13.34421 -13.40084 -0.05663 23.51093 -23.06485 0.44608 -2.95735 4.06815 1.11080
magnitude: 1.19837 au
magnitude: 3.04600 debye
