program: Orca
programVersion: 5.0.2
elementType: O O O C C C C C C C C C C C C C C C C C C C C C C H H H H H H H H H H H H H H H H H H H H H H H H H H
charge: 0
multiplicity: 1
keywords: wb97x-d3
keywords: def2-TZVPP
keywords: def2/J RIJCOSX
keywords: DEFGRID2
keywords: scfconv7
keywords: smallprint printgap noloewdin
keywords: NOSOSCF
formula: C22H26O3
InChI: InChI=1/C22H26O3/c1-15(2)10-19-20(22(19,3)4)21(23)25-14-17-12-18(24-13-17)11-16-8-6-5-7-9-16/h5-10,12-13,19-20H,11,14H2,1-4H3
51 atoms
O  1.707967 -2.221313 -0.30591
O  0.797543 -0.969519 -1.919015
O  -2.758876 -2.52564 0.086576
C  2.173728 1.271617 -0.115252
C  2.876558 1.113225 -1.431002
C  2.599645 -0.108406 -0.594004
C  2.94624 1.823784 1.057149
C  0.71994 1.672005 -0.110284
C  4.27916 1.557474 -1.62921
C  1.605801 -1.108573 -1.032107
C  4.64569 2.710285 -2.195737
C  6.090624 3.070463 -2.362477
C  3.674318 3.730064 -2.70551
C  0.766129 -3.275083 -0.544754
C  -0.580938 -2.926639 -0.023958
C  -0.912644 -2.509453 1.305911
C  -1.743587 -2.909388 -0.713574
C  -2.245775 -2.27391 1.313994
C  -3.17287 -1.740417 2.341889
C  -3.695958 -0.36213 1.999497
C  -2.846784 0.61219 1.479975
C  -5.029815 -0.034485 2.219733
C  -3.318076 1.882883 1.186909
C  -5.505011 1.238913 1.931239
C  -4.651076 2.201898 1.412626
H  2.225978 1.220283 -2.294404
H  3.443167 -0.526301 -0.054107
H  2.479701 1.528944 1.999591
H  2.963229 2.915767 1.023971
H  3.980327 1.480004 1.078396
H  0.217153 1.296036 0.783407
H  0.170018 1.318331 -0.98009
H  0.639567 2.761057 -0.095686
H  5.058986 0.88747 -1.277865
H  6.338243 3.231911 -3.415194
H  6.324346 4.005056 -1.845203
H  6.755924 2.297962 -1.976394
H  2.633327 3.462169 -2.531137
H  3.850496 4.698058 -2.228755
H  3.804173 3.889943 -3.779355
H  1.183769 -4.130465 -0.013762
H  0.725095 -3.529516 -1.605691
H  -0.240133 -2.386281 2.140821
H  -1.988338 -3.139784 -1.739002
H  -2.632677 -1.70609 3.291273
H  -4.013927 -2.422671 2.4925
H  -1.805287 0.376322 1.295437
H  -5.706391 -0.781662 2.618333
H  -2.641585 2.6238 0.778621
H  -6.546416 1.475992 2.108924
H  -5.02136 3.19289 1.18297
elementType: O C H
totalener: -1079.75320305 hartree
nucrepener: 2120.71536665 hartree
electener: -3200.46856970 hartree
oneelecener: -5680.73052625 hartree
twoeener: 2480.26195654 hartree
cpcmener: -0.02654010 hartree
kineticenergy: 1074.86670468 hartree
xcener: -106.462745251801 hartree
chargesum: -0.0000000
charge: -0.282845 -0.463115 -0.277343 0.172947 -0.016070 -0.133472 -0.269980 -0.331536 -0.256183 0.401542 -0.038020 -0.228240 -0.248499 0.095901 -0.054639 -0.343629 -0.033829 0.202954 -0.047881 -0.018616 -0.144246 -0.156819 -0.187902 -0.165801 -0.150612 0.098295 0.092000 0.099138 0.095807 0.091409 0.102211 0.099435 0.102186 0.119114 0.094149 0.093339 0.088730 0.086638 0.094954 0.099502 0.118626 0.117482 0.156702 0.172966 0.106101 0.103687 0.136262 0.139199 0.155434 0.155249 0.157322
qa: -0.2828 -0.4631 -0.2773 0.1729 -0.0161 -0.1335 -0.2700 -0.3315 -0.2562 0.4015 -0.0380 -0.2282 -0.2485 0.0959 -0.0546 -0.3436 -0.0338 0.2030 -0.0479 -0.0186 -0.1442 -0.1568 -0.1879 -0.1658 -0.1506 0.0983 0.0920 0.0991 0.0958 0.0914 0.1022 0.0994 0.1022 0.1191 0.0941 0.0933 0.0887 0.0866 0.0950 0.0995 0.1186 0.1175 0.1567 0.1730 0.1061 0.1037 0.1363 0.1392 0.1554 0.1552 0.1573
va: 2.1175 2.0464 2.2762 3.6574 3.7985 3.8801 3.9005 3.8954 3.8602 4.1999 3.7060 3.9279 3.9393 3.8375 3.6073 3.9720 3.9644 3.6249 3.8361 3.7370 3.8864 3.9024 3.9158 3.9093 3.8937 1.0262 1.0369 1.0035 1.0023 1.0024 0.9955 1.0170 1.0022 1.0075 0.9953 0.9966 1.0077 1.0086 0.9978 0.9982 0.9888 1.0060 1.0117 0.9968 1.0036 1.0096 0.9957 1.0025 0.9938 0.9916 0.9907
dispcorr: -0.024487164 hartree
energy: -1079.777690215372
dipole: 20.64728 -19.95493 0.69235 22.43445 -22.28926 0.14519 -2.61482 3.63216 1.01733
magnitude: 1.23911 au
magnitude: 3.14957 debye
