program: Orca
programVersion: 5.0.2
elementType: O O O C C C C C C C C C C C C C C C C C C C C C C H H H H H H H H H H H H H H H H H H H H H H H H H H
charge: 0
multiplicity: 1
keywords: wb97x-d3
keywords: def2-TZVPP
keywords: def2/J RIJCOSX
keywords: DEFGRID2
keywords: scfconv7
keywords: smallprint printgap noloewdin
keywords: NOSOSCF
formula: C22H26O3
InChI: InChI=1/C22H26O3/c1-15(2)10-19-20(22(19,3)4)21(23)25-14-17-12-18(24-13-17)11-16-8-6-5-7-9-16/h5-10,12-13,19-20H,11,14H2,1-4H3
51 atoms
O  1.69448 -1.888684 -0.590344
O  1.988788 -1.7076 1.61822
O  -2.5409 -2.500877 -0.607985
C  1.341866 1.211515 -0.194958
C  2.511547 0.850746 -1.066081
C  2.371636 0.195829 0.281596
C  1.343244 2.537748 0.524004
C  -0.040795 0.768599 -0.610455
C  3.640605 1.791869 -1.289896
C  2.006297 -1.21682 0.512251
C  3.709523 2.679373 -2.285735
C  4.892678 3.584296 -2.444901
C  2.633108 2.853359 -3.312373
C  1.043469 -3.167498 -0.456132
C  -0.407145 -2.95788 -0.207239
C  -1.055454 -2.630909 1.02759
C  -1.366081 -2.863782 -1.159177
C  -2.344301 -2.351066 0.723264
C  -3.460254 -1.781766 1.525288
C  -3.374268 -0.272315 1.512676
C  -2.713404 0.400026 2.536665
C  -3.874121 0.462349 0.440532
C  -2.551428 1.778212 2.491718
C  -3.712902 1.840605 0.392799
C  -3.048056 2.502655 1.416411
H  2.25438 0.226838 -1.917044
H  3.026792 0.569395 1.062487
H  0.993126 3.333035 -0.138389
H  2.331148 2.820724 0.886545
H  0.670271 2.508251 1.383902
H  -0.534498 1.576455 -1.154927
H  -0.659874 0.538177 0.259576
H  -0.036754 -0.101681 -1.263837
H  4.463875 1.747344 -0.582051
H  5.635767 3.433681 -1.661544
H  5.383787 3.426468 -3.408966
H  4.588824 4.63444 -2.423378
H  2.251348 3.877767 -3.30008
H  3.024799 2.685237 -4.319356
H  1.786921 2.183322 -3.167167
H  1.51874 -3.764528 0.322079
H  1.207291 -3.664412 -1.410936
H  -0.613487 -2.587189 2.009947
H  -1.35533 -3.024667 -2.226484
H  -3.382572 -2.151013 2.548587
H  -4.422433 -2.118338 1.13296
H  -2.315819 -0.160691 3.374886
H  -4.392307 -0.044592 -0.365279
H  -2.035317 2.285793 3.297033
H  -4.106376 2.398586 -0.447599
H  -2.921147 3.577036 1.378159
elementType: O C H
totalener: -1079.74894769 hartree
nucrepener: 2211.03339700 hartree
electener: -3290.78234469 hartree
oneelecener: -5861.30879519 hartree
twoeener: 2570.52645050 hartree
cpcmener: -0.02496565 hartree
kineticenergy: 1074.85826922 hartree
xcener: -106.461037249852 hartree
chargesum: 0.0000000
charge: -0.273424 -0.468926 -0.271412 0.202082 0.007491 -0.129044 -0.291992 -0.323099 -0.274562 0.399766 -0.035599 -0.229091 -0.249633 0.050791 -0.076197 -0.312329 -0.034948 0.209986 -0.052115 0.040383 -0.163739 -0.197707 -0.168579 -0.153853 -0.169309 0.106221 0.093480 0.096453 0.094922 0.096040 0.105281 0.064322 0.099461 0.118739 0.088891 0.094333 0.092824 0.096147 0.101352 0.086894 0.120025 0.116998 0.157303 0.173791 0.107539 0.110682 0.138324 0.136673 0.155962 0.155766 0.156635
qa: -0.2734 -0.4689 -0.2714 0.2021 0.0075 -0.1290 -0.2920 -0.3231 -0.2746 0.3998 -0.0356 -0.2291 -0.2496 0.0508 -0.0762 -0.3123 -0.0349 0.2100 -0.0521 0.0404 -0.1637 -0.1977 -0.1686 -0.1539 -0.1693 0.1062 0.0935 0.0965 0.0949 0.0960 0.1053 0.0643 0.0995 0.1187 0.0889 0.0943 0.0928 0.0961 0.1014 0.0869 0.1200 0.1170 0.1573 0.1738 0.1075 0.1107 0.1383 0.1367 0.1560 0.1558 0.1566
va: 2.1116 2.0298 2.2750 3.5762 3.7882 3.8809 3.9090 3.9213 3.8460 4.2076 3.7107 3.9295 3.9365 3.8660 3.6633 3.9492 3.9391 3.6301 3.8182 3.6115 3.8835 3.9210 3.8746 3.8777 3.8579 1.0179 1.0326 0.9993 1.0047 1.0042 1.0013 1.0101 1.0191 1.0076 1.0075 0.9956 0.9965 0.9979 0.9990 1.0083 1.0084 0.9990 1.0211 0.9949 1.0114 1.0139 1.0037 1.0106 0.9921 0.9913 0.9911
dispcorr: -0.028448927 hartree
energy: -1079.777396616799
dipole: 11.52294 -11.95419 -0.43125 22.51044 -21.88255 0.62790 -9.55639 8.45471 -1.10168
magnitude: 1.33938 au
magnitude: 3.40443 debye
