program: Orca
programVersion: 5.0.2
elementType: O O O C C C C C C C C C C C C C C C C C C C C C C H H H H H H H H H H H H H H H H H H H H H H H H H H
charge: 0
multiplicity: 1
keywords: wb97x-d3
keywords: def2-TZVPP
keywords: def2/J RIJCOSX
keywords: DEFGRID2
keywords: scfconv7
keywords: smallprint printgap noloewdin
keywords: NOSOSCF
formula: C22H26O3
InChI: InChI=1/C22H26O3/c1-15(2)10-19-20(22(19,3)4)21(23)25-14-17-12-18(24-13-17)11-16-8-6-5-7-9-16/h5-10,12-13,19-20H,11,14H2,1-4H3
51 atoms
O  1.645338 -1.823293 -0.676449
O  1.974812 -1.700696 1.531416
O  -2.585185 -2.417952 -0.582558
C  1.291343 1.266255 -0.181682
C  2.439895 0.93095 -1.093163
C  2.330819 0.239056 0.241059
C  1.305629 2.574075 0.570711
C  -0.099681 0.830604 -0.57691
C  3.561134 1.876797 -1.31111
C  1.97604 -1.181563 0.438328
C  3.794008 2.565073 -2.432368
C  4.965954 3.492455 -2.542929
C  2.933808 2.488109 -3.656514
C  0.997764 -3.106474 -0.564764
C  -0.444705 -2.907598 -0.264667
C  -1.057018 -2.642073 1.002816
C  -1.428652 -2.759501 -1.183695
C  -2.351489 -2.33923 0.748998
C  -3.438372 -1.800355 1.609466
C  -3.357876 -0.290687 1.635743
C  -3.901483 0.470761 0.604345
C  -2.658551 0.356322 2.650547
C  -3.743688 1.850089 0.586115
C  -2.500791 1.735676 2.635628
C  -3.040338 2.486773 1.6000
H  2.161847 0.331444 -1.953625
H  3.00602 0.590375 1.015127
H  0.946915 3.385695 -0.066552
H  2.298524 2.847826 0.92657
H  0.64602 2.523388 1.439838
H  -0.696294 0.570135 0.300401
H  -0.107721 -0.018743 -1.257232
H  -0.608609 1.652532 -1.084953
H  4.242238 2.017741 -0.476169
H  5.606791 3.22014 -3.386021
H  4.637261 4.519205 -2.726136
H  5.579819 3.492724 -1.642013
H  2.044854 1.8734 -3.524894
H  2.602458 3.486631 -3.9538
H  3.496651 2.087126 -4.504081
H  1.496989 -3.728509 0.178125
H  1.133116 -3.570702 -1.540214
H  -0.587995 -2.652693 1.973519
H  -1.447848 -2.863464 -2.257931
H  -3.317694 -2.198429 2.617702
H  -4.414115 -2.130537 1.246149
H  -4.451432 -0.015647 -0.192997
H  -2.226434 -0.225129 3.456992
H  -4.170703 2.428861 -0.223264
H  -1.954535 2.223354 3.433328
H  -2.915867 3.562019 1.584666
elementType: O C H
totalener: -1079.74943108 hartree
nucrepener: 2207.24267178 hartree
electener: -3286.99210286 hartree
oneelecener: -5853.74033618 hartree
twoeener: 2566.74823332 hartree
cpcmener: -0.02531493 hartree
kineticenergy: 1074.85701046 hartree
xcener: -106.461196391943 hartree
chargesum: -0.0000000
charge: -0.274124 -0.468031 -0.271269 0.217297 0.027847 -0.145060 -0.281949 -0.314430 -0.296768 0.400710 -0.025441 -0.227989 -0.254152 0.051560 -0.076487 -0.308838 -0.035744 0.206631 -0.052220 0.043433 -0.198771 -0.166454 -0.152731 -0.167850 -0.170584 0.101668 0.091000 0.095401 0.091924 0.093471 0.061022 0.097998 0.104532 0.118320 0.092995 0.093892 0.088376 0.087790 0.093554 0.098828 0.120085 0.117284 0.157051 0.173841 0.107270 0.110969 0.137054 0.138448 0.155626 0.156367 0.156648
qa: -0.2741 -0.4680 -0.2713 0.2173 0.0278 -0.1451 -0.2819 -0.3144 -0.2968 0.4007 -0.0254 -0.2280 -0.2542 0.0516 -0.0765 -0.3088 -0.0357 0.2066 -0.0522 0.0434 -0.1988 -0.1665 -0.1527 -0.1678 -0.1706 0.1017 0.0910 0.0954 0.0919 0.0935 0.0610 0.0980 0.1045 0.1183 0.0930 0.0939 0.0884 0.0878 0.0936 0.0988 0.1201 0.1173 0.1571 0.1738 0.1073 0.1110 0.1371 0.1384 0.1556 0.1564 0.1566
va: 2.1129 2.0306 2.2742 3.5781 3.7547 3.9054 3.9090 3.9260 3.8702 4.1932 3.7124 3.9274 3.9449 3.8662 3.6635 3.9514 3.9380 3.6331 3.8198 3.6086 3.9234 3.8861 3.8775 3.8724 3.8588 1.0197 1.0356 1.0022 1.0051 1.0039 1.0091 1.0198 1.0016 1.0088 0.9955 0.9963 1.0083 1.0083 0.9980 0.9971 1.0080 0.9989 1.0208 0.9948 1.0117 1.0135 1.0107 1.0038 0.9913 0.9919 0.9912
dispcorr: -0.028026243 hartree
energy: -1079.777457317827
dipole: 12.17422 -12.58867 -0.41444 21.71303 -21.12983 0.58320 -9.94641 8.86252 -1.08390
magnitude: 1.29873 au
magnitude: 3.30112 debye
