program: Gaussian 09
title: 000068288
version: EM64L-G09RevD.01
frameworkgroup: C1[X(C7H6N2S)]
method: RPBEPBE
basis: SDD
operation: Freq
keyword: #pfreq=noraman
keyword: PBEPBE/SDD
title: #p freq=noraman PBEPBE/SDD
converged: NO NO NO NO
title: Mulliken charges:
elementType: S N N C C C C C C C H H H H H H
charge: 0.224784 -0.000874 -0.703884 -0.324614 0.338924 -0.500061 0.543174 -0.289721 -0.419886 -0.461305 0.237223 0.251189 0.220493 0.263731 0.310483 0.310342
chargesum: 0.00000
title: Mulliken charges with hydrogens summed into heavy atoms:
elementType: S N N C C C C C C C
charge: 0.224784 -0.000874 -0.083059 -0.324614 0.338924 -0.262838 0.543174 -0.038532 -0.199393 -0.197574
polarizability: 1.67974198e+02 8.58084554e-01 1.08118634e+02 -6.39130857e-03 -4.35015331e-03 4.04534180e+01
1716.lowfreq: -0.0030 -0.0013 -0.0006 10.9020 14.3330 18.3513 136.7802 188.2082 270.4772
frequency: 136.7707 188.2020 270.4768 303.4314 363.5426 385.8640 393.1126 436.4257 441.5350 513.1226 517.5994 595.2069 612.8843 677.5763 728.2181 736.6355 771.0228 794.4808 820.4400 844.9136 884.5395 954.4289 1012.9234 1034.2078 1124.7615 1189.3489 1251.3391 1268.0859 1310.8411 1379.1610 1439.6284 1466.3004 1477.8896 1561.6071 1628.8924 1646.9814 3127.5496 3140.0638 3167.3634 3216.4779 3567.2087 3706.2954
redmass: 4.8379 5.4270 5.0763 4.1059 1.0780 1.2126 4.2780 2.7858 7.5822 6.3166 7.1767 8.2447 3.1420 7.3617 2.5238 5.8945 1.4569 5.9593 1.5097 1.6578 4.9902 1.3560 2.7436 1.5217 1.4020 1.4332 1.4030 1.9500 2.3218 4.8046 4.7487 6.8905 4.9910 6.4021 4.4865 1.2765 1.0891 1.0921 1.0958 1.0960 1.0451 1.1039
irintensity: 3.4561 3.8583 3.3688 0.7660 75.5001 254.4584 0.3026 3.5964 0.8650 2.8017 0.3946 22.0585 6.5003 0.1972 5.3920 27.3728 16.4223 21.1552 50.2903 51.1678 17.4087 0.4322 15.2429 1.2805 12.0966 4.8427 9.3656 4.4789 25.9221 18.6493 20.6030 21.3732 115.2812 34.6136 129.7102 278.2121 15.4953 11.3919 9.0209 0.4901 92.9239 22.7603
temp: 298.150 k
press: 1.00000 atm
elementType: 16 7 7 6 6 6 6 6 6 6 1 1 1 1 1 1
symmnumber: 1
zpe: 305570.2 jmol-1
zpe.correction: 0.116386 hartree
zpe.thermalcorrener: 0.124522 hartree
zpe.thermalcorrenthalpy: 0.125466 hartree
zpe.thermalcorrgfe: 0.083617 hartree
zpe.sumelectzpe: -777.213281 hartree
zpe.sumelectthermal: -777.205145 hartree
zpe.sumelectthermalent: -777.204200 hartree
zpe.sumelectthermalfe: -777.246050 hartree
dipole: -3.6962 -1.7335 0.0004
dipole: 4.0825
quadrupole: -46.4390 -62.7082 -70.6014
quadrupole: 0.4560 -0.0017 -0.0004
quadrupole: 13.4772 -2.7920 -10.6852 0.4560 -0.0017 -0.0004
hfenergy: -777.3296667 hartree
pointgroup: C01 [X(C7H6N2S1)]
dipole: 1.521604 0.5143802 0.0001481 debye
dipolederiv: -0.2882319 -0.1552093 -0.0000357 0.0586868 -0.4449777 -0.0000396 -0.000021 -0.0000496 0.0827955 0.1055787 0.1963173 0.0000299 -0.0915867 -0.7600107 -0.0000527 0.0000124 -0.0000322 -0.1637764 -1.6327119 -0.281547 -0.0000373 -0.4715794 -0.1949239 -0.0000108 0.0000088 0.00001 -0.7491849 0.6675091 -0.0781237 0.0000284 -0.1229495 0.1066968 -0.0000056 0.0000248 -0.0000111 -0.0702791 -0.2652678 -0.0054197 -0.0000098 -0.0054643 -0.1741666 -0.0000092 -0.0000118 -0.0000058 -0.0069026 -0.6610494 -0.0891354 -0.0000222 0.3461278 0.0326885 0.0000401 -0.0000104 0.0000259 -0.2134668 1.6732675 0.3222687 0.0000655 0.4550111 0.1946717 0.0000274 0.0000594 0.0000128 0.1557689 0.4428028 -0.1206999 0.0000246 0.0047221 0.1381995 0.0000243 0.0000267 0.0000173 -0.0928564 -0.3368342 -0.0283331 0.0000054 -0.5635476 -0.0537191 -0.0000311 -0.000009 -0.0000022 -0.2455477 -0.1896481 0.1659173 0.0000176 0.3454058 0.9655154 0.000115 0.0000212 0.0001022 -0.1885319 0.0402357 -0.0382513 -0.0000083 -0.0660313 -0.0627653 -0.0000202 -0.000005 -0.0000212 0.1815518 0.0872057 -0.0456038 -0.0000098 -0.0100545 -0.0569837 -0.0000154 -0.0000062 -0.0000216 0.1618223 -0.0792403 0.1158744 -0.000014 0.0883732 0.0069517 0.0000007 -0.0000155 0.0000063 0.171462 0.0009134 -0.0053466 -0.0000147 -0.0273046 0.0537808 -0.0000133 -0.0000147 -0.0000116 0.1953487 0.237193 0.0117439 -0.00001 -0.0183035 0.1219134 -0.0000029 -0.0000386 -0.0000037 0.3910692 0.1982778 0.0355481 -0.0000098 0.0784947 0.1271292 -0.0000068 -0.0000212 -0.0000155 0.3907274 unknown
polarizability: 167.4108501|-5.8428103|108.6819814|0.0068394|0.0036049|40.453418 unknown
InChI: InChI=1S/C7H6N2S/c8-5-1-2-6-7(3-5)10-4-9-6/h1-4H,8H2
charge 0 multiplicity 1
16 atoms
S  -1.96385 1.689041 0.000143
N  -2.120707 -1.003998 -0.000074
N  3.28253 0.646583 0.000311
C  -0.428737 0.713941 0.000177
C  -0.744336 -0.687253 0.000048
C  0.893771 1.18446 0.000244
C  1.952174 0.229972 0.000252
C  0.317299 -1.624471 0.000065
C  1.643733 -1.173073 0.000174
C  -2.866909 0.077601 -0.00005
H  1.120575 2.256038 0.000324
H  0.080811 -2.693024 -0.000027
H  2.467224 -1.897497 0.000212
H  -3.957268 0.082623 -0.000132
H  4.038962 -0.031081 0.000367
H  3.524228 1.633139 0.000368
