program: Orca
programVersion: 5.0.2
elementType: O O O C C C C C C C C C C C C C C C C C C C C C C H H H H H H H H H H H H H H H H H H H H H H H H H H
charge: 0
multiplicity: 1
keywords: wb97x-d3
keywords: def2-TZVPP
keywords: def2/J RIJCOSX
keywords: DEFGRID2
keywords: scfconv7
keywords: smallprint printgap noloewdin
keywords: NOSOSCF
formula: C22H26O3
InChI: InChI=1/C22H26O3/c1-15(2)10-19-20(22(19,3)4)21(23)25-14-17-12-18(24-13-17)11-16-8-6-5-7-9-16/h5-10,12-13,19-20H,11,14H2,1-4H3
51 atoms
O  1.275929 0.378325 0.152781
O  2.915459 1.491821 1.177719
O  -3.093051 0.374732 -0.146741
C  4.710823 -0.652429 -0.286379
C  4.770727 0.658101 -0.992686
C  3.417981 0.055269 -0.671545
C  5.005838 -1.911241 -1.065541
C  5.143531 -0.731947 1.15642
C  5.22853 0.777782 -2.401586
C  2.552291 0.718532 0.320764
C  4.686253 1.572579 -3.327876
C  5.243078 1.643681 -4.716896
C  3.498643 2.44946 -3.075936
C  0.312235 0.98059 1.032579
C  -1.026704 0.469213 0.652693
C  -1.56106 -0.838672 0.890062
C  -2.00529 1.153391 0.017046
C  -2.816354 -0.839789 0.385134
C  -3.89964 -1.855187 0.365203
C  -5.082158 -1.421227 1.198056
C  -6.248826 -0.962153 0.597559
C  -5.003368 -1.437696 2.588774
C  -7.319993 -0.530578 1.370179
C  -6.070388 -1.007709 3.362655
C  -7.233248 -0.5507 2.754425
H  5.031812 1.497798 -0.352144
H  2.883137 -0.395641 -1.499843
H  4.535914 -2.775524 -0.592185
H  6.080961 -2.10056 -1.099576
H  4.645273 -1.862641 -2.093202
H  4.599646 -1.515162 1.688676
H  5.003528 0.201343 1.697343
H  6.205869 -0.97988 1.207577
H  6.098431 0.186866 -2.67699
H  5.578461 2.657081 -4.953117
H  6.08738 0.968927 -4.858367
H  4.480802 1.391138 -5.458822
H  3.159898 2.434865 -2.041808
H  3.727438 3.486815 -3.334025
H  2.657397 2.154916 -3.709393
H  0.348973 2.068395 0.942413
H  0.546435 0.72008 2.067115
H  -1.071203 -1.662978 1.384624
H  -2.064954 2.163577 -0.358109
H  -3.486359 -2.789736 0.74855
H  -4.219918 -2.049192 -0.662149
H  -6.323311 -0.943464 -0.483397
H  -4.097651 -1.789429 3.069898
H  -8.222053 -0.175766 0.887952
H  -5.995333 -1.028768 4.442494
H  -8.066398 -0.213128 3.35742
elementType: O C H
totalener: -1079.75463226 hartree
nucrepener: 2013.25857568 hartree
electener: -3093.01320793 hartree
oneelecener: -5465.45061330 hartree
twoeener: 2372.43740537 hartree
cpcmener: -0.02567982 hartree
kineticenergy: 1074.86700316 hartree
xcener: -106.460178643442 hartree
chargesum: -0.0000000
charge: -0.277330 -0.480519 -0.277411 0.142422 -0.004151 -0.103647 -0.282903 -0.280332 -0.296248 0.392322 -0.013362 -0.227869 -0.240456 0.086900 -0.082521 -0.312347 -0.028094 0.186126 -0.059271 0.040352 -0.184170 -0.191829 -0.157870 -0.161016 -0.167441 0.101339 0.095113 0.096649 0.097991 0.093060 0.097768 0.092071 0.094258 0.120186 0.095794 0.089060 0.093050 0.083836 0.100472 0.098916 0.107800 0.111031 0.160200 0.174677 0.115805 0.108950 0.139295 0.142346 0.156141 0.156802 0.158056
qa: -0.2773 -0.4805 -0.2774 0.1424 -0.0042 -0.1036 -0.2829 -0.2803 -0.2962 0.3923 -0.0134 -0.2279 -0.2405 0.0869 -0.0825 -0.3123 -0.0281 0.1861 -0.0593 0.0404 -0.1842 -0.1918 -0.1579 -0.1610 -0.1674 0.1013 0.0951 0.0966 0.0980 0.0931 0.0978 0.0921 0.0943 0.1202 0.0958 0.0891 0.0930 0.0838 0.1005 0.0989 0.1078 0.1110 0.1602 0.1747 0.1158 0.1089 0.1393 0.1423 0.1561 0.1568 0.1581
va: 2.1133 2.0246 2.2776 3.7053 3.7938 3.8445 3.9079 3.8949 3.8919 4.1274 3.7133 3.9311 3.9359 3.8492 3.7332 3.9983 3.9469 3.6426 3.8228 3.5920 3.9479 3.9386 3.8997 3.9083 3.8971 1.0281 1.0288 1.0033 1.0003 1.0024 0.9993 1.0191 1.0012 1.0044 0.9961 1.0065 0.9970 1.0119 0.9995 0.9988 1.0024 0.9934 1.0080 0.9950 1.0070 1.0069 1.0047 1.0033 0.9912 0.9913 0.9902
dispcorr: -0.021836728 hartree
energy: -1079.776468985121
dipole: 26.29225 -26.57984 -0.28759 -0.90241 0.13613 -0.76628 -12.45513 11.75229 -0.70284
magnitude: 1.07883 au
magnitude: 2.74217 debye
