program: Gaussian 09
title: 000068289
version: EM64L-G09RevD.01
frameworkgroup: C1[X(C7H6O3)]
method: RPBEPBE
basis: SDD
operation: Freq
keyword: #p
keyword: freq=noraman
keyword: PBEPBE/SDD
title: #p freq=noraman PBEPBE/SDD
converged: NO NO NO NO
title: Mulliken charges:
elementType: O O O C C C C C C C H H H H H H
charge: -0.268964 -0.268990 -0.437818 0.243800 0.162720 -0.199927 -0.464942 -0.295367 0.338230 -0.379382 0.235976 0.236031 0.274295 0.249969 0.221142 0.353227
chargesum: 0.00000
title: Mulliken charges with hydrogens summed into heavy atoms:
elementType: O O O C C C C C C C
charge: -0.268964 -0.268990 -0.084590 0.243800 0.162720 0.272081 -0.190647 -0.045398 0.338230 -0.158240
polarizability: 1.22245890e+02 4.31562708e+00 8.38332381e+01 1.53523320e-03 -2.99036911e-04 3.84021710e+01
1716.lowfreq: -68.3238 -6.8496 -0.0009 -0.0008 -0.0006 6.2316 15.3128 151.2082 220.9143
frequency: -68.3119 151.2079 220.9136 307.8011 326.6409 341.6492 422.6464 424.0789 465.4979 593.6654 593.9013 678.5988 700.1054 732.6450 774.3092 775.3862 846.6591 849.8616 894.4801 914.8063 978.3922 1052.0044 1066.1353 1120.6642 1126.6613 1138.0145 1188.8503 1261.3007 1271.5630 1367.3263 1407.9235 1456.8694 1483.5933 1491.0069 1625.4348 1631.7806 3006.1445 3082.1414 3129.2819 3182.5697 3198.7258 3588.1636
redmass: 2.3958 8.4174 5.9483 5.9214 7.4854 1.1017 3.0566 5.9798 6.0171 3.6839 6.0267 9.8292 4.4733 7.9668 1.4156 6.2578 10.1556 1.4679 1.3193 4.1526 5.4505 3.2286 1.4564 1.0361 1.4433 1.5183 1.6668 1.4840 4.3025 1.2678 4.4348 4.0655 1.5121 1.9208 7.8283 8.3596 1.0533 1.1189 1.0902 1.0951 1.0940 1.0661
irintensity: 16.4306 0.0009 2.0175 10.0663 1.3082 145.9927 1.6251 2.9240 2.9814 18.7185 1.1424 0.0837 0.6658 19.7361 56.7849 20.2911 33.5454 36.3046 3.8772 27.3867 159.0318 23.0441 4.4230 0.0014 76.9535 171.3153 49.7346 78.4856 38.2229 1.8004 114.1164 75.0476 43.3462 75.9490 18.4230 38.1282 120.3594 36.0790 13.6813 3.3667 0.0175 38.7895
temp: 298.150 k
press: 1.00000 atm
elementType: 8 8 8 6 6 6 6 6 6 6 1 1 1 1 1 1
symmnumber: 1
zpe: 304266.6 jmol-1
zpe.correction: 0.115889 hartree
zpe.thermalcorrener: 0.123203 hartree
zpe.thermalcorrenthalpy: 0.124147 hartree
zpe.thermalcorrgfe: 0.084035 hartree
zpe.sumelectzpe: -495.253956 hartree
zpe.sumelectthermal: -495.246642 hartree
zpe.sumelectthermalent: -495.245698 hartree
zpe.sumelectthermalfe: -495.285809 hartree
dipole: 0.2307 1.5040 0.0022
dipole: 1.5216
quadrupole: -44.4775 -58.5153 -59.6802
quadrupole: 8.2199 -0.0049 0.0002
quadrupole: 9.7468 -4.2910 -5.4559 8.2199 -0.0049 0.0002
hfenergy: -495.3698446 hartree
pointgroup: C01 [X(C7H6O3)]
dipole: -0.0826968 0.5928872 -0.0008696 debye
dipolederiv: -1.2979507 0.2201045 0.0001936 0.3140857 -0.5248164 0.0000902 -0.0001831 0.0001209 -0.2554382 -1.3786671 0.1250332 0.00014 0.0611003 -0.4304745 -0.0001612 -0.0002809 -0.0000234 -0.2482977 -1.3646834 -0.368201 -0.0000761 -0.4183401 -0.1869481 0.0000102 -0.0001719 -0.0000269 -0.4278696 0.8462598 -0.1891369 0.0001754 -0.797637 0.4111843 0.0000068 0.0003273 -0.0000448 0.0534583 0.9921158 -0.0040373 0.0001829 0.5152148 -0.2409458 -0.0000764 0.0004267 -0.0001062 -0.0003505 1.1842263 -0.1271641 -0.0006224 -0.1398441 0.5760215 0.0001373 -0.0007619 0.0001641 0.5844926 -0.3578889 -0.0349565 -0.0000746 0.1061482 0.0155789 0.0000139 -0.0000334 -0.0000104 -0.1882531 0.124004 -0.1537044 -0.0000582 0.077161 0.1031728 0.000026 0.0000026 0.0000132 -0.1339719 1.2699909 0.2576432 0.0001366 0.4475963 0.2131763 -0.0000502 0.00016 0.0000584 0.0675966 -0.3058477 0.0870012 0.0000644 -0.3874072 -0.1209038 0.0000006 -0.0000119 -0.0000356 -0.2488118 -0.0993452 0.0344374 0.0681844 0.0341837 0.053658 -0.0151517 0.1685668 -0.0361618 -0.0770715 -0.0995762 0.0345264 -0.068194 0.0342621 0.0538237 0.0151503 -0.168065 0.0360485 -0.0763485 0.1078413 -0.0164644 -0.0000091 -0.0187093 0.0039873 0.0000062 0.0000148 -0.0000118 0.1972106 0.089669 -0.0409291 -0.0000078 -0.0392682 -0.0405211 -0.0000055 0.0000112 0. 0.1794271 -0.0807902 0.0967295 -0.0000309 0.0786615 0.0274992 0.0000161 -0.0000322 0.0000267 0.1874973 0.3706425 0.0791185 -0.0000041 0.1327924 0.0865077 -0.0000125 0.0000309 -0.0000109 0.3867302 unknown
polarizability: 122.1209508|-4.8382096|83.9581773|0.0015392|0.0002781|38.402171 unknown
InChI: InChI=1S/C7H6O3/c8-5-1-2-6-7(3-5)10-4-9-6/h1-3,8H,4H2
charge 0 multiplicity 1
16 atoms
O  1.663367 -1.408424 0.000566
O  2.158859 0.94579 0.000608
O  -3.188156 -0.696639 -0.000174
C  0.465787 -0.654038 0.000221
C  0.753292 0.729354 0.000211
C  2.766919 -0.409307 -0.00034
C  -0.836758 -1.150945 0.00012
C  -0.263489 1.684393 0.00012
C  -1.877633 -0.181599 -0.000001
C  -1.60473 1.208464 -0.000012
H  3.362815 -0.537322 -0.921181
H  3.364701 -0.537734 0.919177
H  -1.065493 -2.218039 0.000141
H  -0.040917 2.754111 0.000152
H  -2.430646 1.930349 -0.000143
H  -3.852419 0.035985 -0.000164
