program: Orca
programVersion: 5.0.2
elementType: O O O C C C C C C C C C C C C C C C C C C C C C C H H H H H H H H H H H H H H H H H H H H H H H H H H
charge: 0
multiplicity: 1
keywords: wb97x-d3
keywords: def2-TZVPP
keywords: def2/J RIJCOSX
keywords: DEFGRID2
keywords: scfconv7
keywords: smallprint printgap noloewdin
keywords: NOSOSCF
formula: C22H26O3
InChI: InChI=1/C22H26O3/c1-15(2)10-19-20(22(19,3)4)21(23)25-14-17-12-18(24-13-17)11-16-8-6-5-7-9-16/h5-10,12-13,19-20H,11,14H2,1-4H3
51 atoms
O  1.585849 -1.949974 -0.343645
O  0.817601 -0.696516 -2.029164
O  -2.319541 -2.793016 1.321662
C  1.630981 1.500899 0.143752
C  2.458068 1.585489 -1.096882
C  2.30159 0.249808 -0.410047
C  2.197259 2.014925 1.44434
C  0.13266 1.662169 0.04433
C  3.782893 2.260255 -1.128964
C  1.492755 -0.815052 -1.03296
C  4.806567 1.888343 -1.901996
C  6.10266 2.640076 -1.90397
C  4.753431 0.711039 -2.826158
C  0.714544 -3.038798 -0.698241
C  -0.645377 -2.823006 -0.134098
C  -1.734125 -2.072481 -0.686954
C  -1.069091 -3.234836 1.084556
C  -2.719539 -2.081921 0.240778
C  -4.028796 -1.381656 0.32584
C  -3.871452 -0.047779 1.019513
C  -3.789219 0.027818 2.407775
C  -3.743583 1.121924 0.276032
C  -3.578641 1.246137 3.038187
C  -3.536838 2.342737 0.904545
C  -3.448907 2.407802 2.288295
H  1.878465 1.67396 -2.012951
H  3.144767 -0.105751 0.172622
H  2.021985 3.088362 1.545491
H  3.270378 1.844058 1.532141
H  1.715223 1.523039 2.291553
H  -0.138069 2.705475 0.218746
H  -0.37743 1.06106 0.799896
H  -0.265474 1.384727 -0.929873
H  3.903753 3.135385 -0.496139
H  6.319377 3.047056 -2.89536
H  6.101445 3.467538 -1.194346
H  6.938316 1.981377 -1.652941
H  5.531668 -0.014566 -2.574195
H  3.796171 0.19278 -2.812063
H  4.947713 1.022305 -3.856129
H  1.179839 -3.917926 -0.255459
H  0.691463 -3.178599 -1.779288
H  -1.772381 -1.583057 -1.646581
H  -0.606125 -3.830215 1.856715
H  -4.756848 -2.003789 0.851914
H  -4.408012 -1.231685 -0.685581
H  -3.890915 -0.871702 3.003728
H  -3.805441 1.078119 -0.805259
H  -3.515495 1.288162 4.118273
H  -3.44352 3.243603 0.311173
H  -3.284626 3.358111 2.780071
elementType: O C H
totalener: -1079.75206005 hartree
nucrepener: 2163.93349200 hartree
electener: -3243.68555205 hartree
oneelecener: -5767.44850848 hartree
twoeener: 2523.76295643 hartree
cpcmener: -0.02377248 hartree
kineticenergy: 1074.85991708 hartree
xcener: -106.459810872228 hartree
chargesum: -0.0000000
charge: -0.280858 -0.471556 -0.274953 0.188512 -0.028779 -0.116179 -0.292997 -0.298056 -0.289852 0.399183 -0.018266 -0.229038 -0.237752 0.069913 -0.060749 -0.350860 -0.040864 0.235540 -0.052748 0.061506 -0.201523 -0.214054 -0.148780 -0.159113 -0.167513 0.103743 0.095237 0.099046 0.093642 0.097314 0.098459 0.091854 0.093023 0.121511 0.095799 0.089003 0.093702 0.096080 0.078164 0.099665 0.117432 0.118228 0.157213 0.174261 0.113607 0.105527 0.138991 0.138066 0.156373 0.156471 0.157427
qa: -0.2809 -0.4716 -0.2750 0.1885 -0.0288 -0.1162 -0.2930 -0.2981 -0.2899 0.3992 -0.0183 -0.2290 -0.2378 0.0699 -0.0607 -0.3509 -0.0409 0.2355 -0.0527 0.0615 -0.2015 -0.2141 -0.1488 -0.1591 -0.1675 0.1037 0.0952 0.0990 0.0936 0.0973 0.0985 0.0919 0.0930 0.1215 0.0958 0.0890 0.0937 0.0961 0.0782 0.0997 0.1174 0.1182 0.1572 0.1743 0.1136 0.1055 0.1390 0.1381 0.1564 0.1565 0.1574
va: 2.1212 2.0287 2.2780 3.7075 3.8278 3.8124 3.9016 3.8818 3.8835 4.1608 3.7149 3.9303 3.9351 3.8540 3.6475 3.9653 3.9703 3.5923 3.8138 3.5838 3.9573 3.9084 3.9010 3.8594 3.8879 1.0263 1.0305 0.9996 1.0020 1.0028 1.0024 0.9954 1.0154 1.0033 0.9958 1.0064 0.9968 0.9991 1.0190 0.9995 0.9969 1.0075 1.0210 0.9941 1.0114 1.0117 1.0118 1.0059 0.9907 0.9918 0.9900
dispcorr: -0.025860661 hartree
energy: -1079.777920713406
dipole: 19.78435 -19.37697 0.40738 16.74441 -16.81966 -0.07525 -3.57349 4.17586 0.60237
magnitude: 0.73107 au
magnitude: 1.85824 debye
