program: Orca
programVersion: 5.0.2
elementType: O O O C C C C C C C C C C C C C C C C C C C C C C H H H H H H H H H H H H H H H H H H H H H H H H H H
charge: 0
multiplicity: 1
keywords: wb97x-d3
keywords: def2-TZVPP
keywords: def2/J RIJCOSX
keywords: DEFGRID2
keywords: scfconv7
keywords: smallprint printgap noloewdin
keywords: NOSOSCF
formula: C22H26O3
InChI: InChI=1/C22H26O3/c1-15(2)10-19-20(22(19,3)4)21(23)25-14-17-12-18(24-13-17)11-16-8-6-5-7-9-16/h5-10,12-13,19-20H,11,14H2,1-4H3
51 atoms
O  1.735616 -2.129511 0.014372
O  1.019301 -1.117428 -1.849872
O  -2.289671 -2.771024 1.529077
C  1.876975 1.415927 -0.194249
C  2.878703 1.141298 -1.278255
C  2.480963 0.029936 -0.342642
C  2.312271 2.201668 1.018457
C  0.440303 1.673357 -0.57771
C  4.26061 1.673556 -1.223653
C  1.667896 -1.103095 -0.83525
C  4.736014 2.680315 -1.958084
C  6.160828 3.128952 -1.83414
C  3.916658 3.441475 -2.955164
C  0.880904 -3.25235 -0.228052
C  -0.511199 -2.975792 0.217329
C  -1.563233 -2.341201 -0.516088
C  -1.023171 -3.210613 1.449069
C  -2.614203 -2.241046 0.329715
C  -3.949082 -1.603463 0.199415
C  -4.020503 -0.291097 0.945703
C  -4.80952 -0.148021 2.078553
C  -3.264765 0.794931 0.513491
C  -4.848592 1.0576 2.766785
C  -3.3010 1.998966 1.196422
C  -4.094356 2.133842 2.328234
H  2.446374 1.051343 -2.270185
H  3.196922 -0.236711 0.427703
H  2.261973 3.272855 0.814462
H  3.333973 1.977404 1.322397
H  1.65799 1.991007 1.866079
H  -0.237404 1.348029 0.214686
H  0.150298 1.168875 -1.496182
H  0.288959 2.745131 -0.722482
H  4.937533 1.193306 -0.522546
H  6.217922 4.18066 -1.542338
H  6.712284 2.545978 -1.09747
H  6.6849 3.042864 -2.789414
H  4.328231 3.334367 -3.961915
H  2.875226 3.127987 -2.983433
H  3.932351 4.510107 -2.727106
H  1.318823 -4.062392 0.354149
H  0.910128 -3.537029 -1.280815
H  -1.521854 -1.996668 -1.535839
H  -0.611146 -3.668295 2.334285
H  -4.732428 -2.27871 0.553589
H  -4.138915 -1.439507 -0.863395
H  -5.398383 -0.986647 2.430324
H  -2.635383 0.692288 -0.363106
H  -5.467069 1.15255 3.649742
H  -2.707331 2.833486 0.846016
H  -4.122573 3.073264 2.864326
totalener: -1079.73210144 hartree
nucrepener: 2127.78692054 hartree
electener: -3207.51902198 hartree
oneelecener: -5693.93231388 hartree
twoeener: 2486.41329190 hartree
kineticenergy: 1074.92119768 hartree
xcener: -106.468149726351 hartree
chargesum: 0.0000000
charge: -0.259114 -0.401397 -0.248048 0.162498 -0.006161 -0.138298 -0.236046 -0.311044 -0.195487 0.375500 -0.028737 -0.211381 -0.236606 0.044879 -0.058279 -0.279065 -0.032019 0.233968 -0.133560 0.070500 -0.144951 -0.175068 -0.122702 -0.129403 -0.131621 0.098507 0.072610 0.085802 0.075243 0.094783 0.089619 0.103073 0.086358 0.082720 0.083508 0.077712 0.085655 0.090422 0.080939 0.083183 0.099917 0.113015 0.145527 0.134345 0.093678 0.112220 0.105394 0.124861 0.122550 0.126131 0.123871
qa: -0.2591 -0.4014 -0.2480 0.1625 -0.0062 -0.1383 -0.2360 -0.3110 -0.1955 0.3755 -0.0287 -0.2114 -0.2366 0.0449 -0.0583 -0.2791 -0.0320 0.2340 -0.1336 0.0705 -0.1450 -0.1751 -0.1227 -0.1294 -0.1316 0.0985 0.0726 0.0858 0.0752 0.0948 0.0896 0.1031 0.0864 0.0827 0.0835 0.0777 0.0857 0.0904 0.0809 0.0832 0.0999 0.1130 0.1455 0.1343 0.0937 0.1122 0.1054 0.1249 0.1225 0.1261 0.1239
va: 2.1349 2.1037 2.3129 3.6843 3.7863 3.9501 3.9000 3.9163 3.8890 4.2142 3.7507 3.9401 3.9480 3.9070 3.6983 3.9994 4.0007 3.5892 3.8845 3.6590 3.9999 3.9802 3.9608 3.9600 3.9709 1.0265 1.0400 1.0061 1.0094 1.0044 1.0015 1.0203 1.0032 1.0165 0.9986 1.0114 0.9974 0.9998 1.0119 1.0000 0.9966 1.0055 1.0230 1.0073 1.0143 1.0052 1.0118 1.0019 1.0007 1.0006 1.0000
dispcorr: -0.024452040 hartree
energy: -1079.756553480592
dipole: 18.57215 -18.35580 0.21635 23.14716 -22.89647 0.25070 -6.21085 6.57558 0.36473
magnitude: 0.49263 au
magnitude: 1.25216 debye
