program: Orca
programVersion: 5.0.2
elementType: O O O C C C C C C C C C C C C C C C C C C C C C C H H H H H H H H H H H H H H H H H H H H H H H H H H
charge: 0
multiplicity: 1
keywords: wb97x-d3
keywords: def2-TZVPP
keywords: def2/J RIJCOSX
keywords: DEFGRID2
keywords: scfconv7
keywords: smallprint printgap noloewdin
keywords: NOSOSCF
formula: C22H26O3
InChI: InChI=1/C22H26O3/c1-15(2)10-19-20(22(19,3)4)21(23)25-14-17-12-18(24-13-17)11-16-8-6-5-7-9-16/h5-10,12-13,19-20H,11,14H2,1-4H3
51 atoms
O  0.838136 -0.618161 -1.537183
O  2.181791 -2.261314 -0.833698
O  -1.533425 -2.945569 1.354685
C  2.711856 1.029135 0.37567
C  2.810065 1.420702 -1.063931
C  2.956835 -0.033538 -0.682177
C  3.878084 1.313787 1.291623
C  1.375173 1.123299 1.071038
C  3.980593 2.17315 -1.586092
C  1.972287 -1.089843 -1.009941
C  4.587558 1.951704 -2.752736
C  5.765214 2.771859 -3.185008
C  4.156741 0.891823 -3.719965
C  -0.212178 -1.564123 -1.763908
C  -0.928757 -1.905641 -0.506548
C  -1.957342 -1.147294 0.139476
C  -0.716569 -2.980983 0.286983
C  -2.284787 -1.826467 1.263316
C  -3.265186 -1.576137 2.356277
C  -4.051403 -0.318681 2.108184
C  -3.546264 0.919332 2.491783
C  -5.280008 -0.367036 1.4599
C  -4.255394 2.083307 2.236655
C  -5.993395 0.794363 1.203764
C  -5.482594 2.02355 1.592341
H  1.859617 1.67595 -1.524795
H  3.967572 -0.42655 -0.688356
H  3.807881 2.322287 1.704746
H  4.837583 1.231644 0.781486
H  3.887228 0.614419 2.12894
H  1.297039 0.382379 1.868943
H  0.532722 0.975218 0.399533
H  1.264945 2.110126 1.525069
H  4.34961 2.983411 -0.962741
H  6.038749 3.519436 -2.44129
H  6.638085 2.138195 -3.361853
H  5.561866 3.290166 -4.125274
H  3.942812 1.332053 -4.697072
H  4.953171 0.160303 -3.879075
H  3.267088 0.356126 -3.397145
H  0.181438 -2.459312 -2.246672
H  -0.88218 -1.06843 -2.46534
H  -2.39616 -0.221197 -0.19528
H  -0.029453 -3.808292 0.220889
H  -2.74001 -1.5070 3.314444
H  -3.94377 -2.429866 2.446628
H  -2.587302 0.972219 2.993863
H  -5.682591 -1.324437 1.15137
H  -3.850259 3.038435 2.544488
H  -6.950123 0.738429 0.701367
H  -6.038532 2.930752 1.395841
totalener: -1079.72999206 hartree
nucrepener: 2110.02520357 hartree
electener: -3189.75519564 hartree
oneelecener: -5658.26292883 hartree
twoeener: 2468.50773319 hartree
kineticenergy: 1074.91219756 hartree
xcener: -106.467216115687 hartree
chargesum: 0.0000000
charge: -0.266715 -0.373675 -0.254699 0.129266 0.028404 -0.133255 -0.278245 -0.264834 -0.267781 0.351027 -0.003206 -0.212787 -0.221797 0.031435 -0.066605 -0.284886 0.007299 0.185069 -0.051120 0.023170 -0.163561 -0.150118 -0.121546 -0.124547 -0.126996 0.099299 0.092676 0.086696 0.085419 0.094485 0.094780 0.084343 0.084749 0.092546 0.078172 0.085211 0.086372 0.089180 0.089017 0.078630 0.113748 0.101565 0.139343 0.151485 0.095129 0.091705 0.110654 0.109301 0.124844 0.125133 0.126217
qa: -0.2667 -0.3737 -0.2547 0.1293 0.0284 -0.1333 -0.2782 -0.2648 -0.2678 0.3510 -0.0032 -0.2128 -0.2218 0.0314 -0.0666 -0.2849 0.0073 0.1851 -0.0511 0.0232 -0.1636 -0.1501 -0.1215 -0.1245 -0.1270 0.0993 0.0927 0.0867 0.0854 0.0945 0.0948 0.0843 0.0847 0.0925 0.0782 0.0852 0.0864 0.0892 0.0890 0.0786 0.1137 0.1016 0.1393 0.1515 0.0951 0.0917 0.1107 0.1093 0.1248 0.1251 0.1262
va: 2.0833 2.1281 2.3081 3.7387 3.7637 3.8444 3.9099 3.9068 3.9089 4.2011 3.7313 3.9423 3.9365 3.8933 3.6724 3.9851 3.9870 3.6798 3.8586 3.6640 3.9747 3.9870 3.9549 3.9630 3.9535 1.0234 1.0272 1.0012 1.0054 1.0052 1.0013 1.0167 1.0039 1.0097 1.0099 0.9992 0.9988 1.0016 1.0014 1.0221 1.0092 0.9950 1.0089 1.0135 1.0054 1.0087 1.0114 1.0113 1.0003 1.0004 0.9996
dispcorr: -0.024387360 hartree
energy: -1079.754379424235
dipole: 20.00419 -20.40055 -0.39636 16.87883 -16.02675 0.85208 -6.12552 5.99928 -0.12624
magnitude: 0.94820 au
magnitude: 2.41013 debye
