program: Orca
programVersion: 5.0.2
elementType: O O O C C C C C C C C C C C C C C C C C C C C C C H H H H H H H H H H H H H H H H H H H H H H H H H H
charge: 0
multiplicity: 1
keywords: wb97x-d3
keywords: def2-TZVPP
keywords: def2/J RIJCOSX
keywords: DEFGRID2
keywords: scfconv7
keywords: smallprint printgap noloewdin
keywords: NOSOSCF
formula: C22H26O3
InChI: InChI=1/C22H26O3/c1-15(2)10-19-20(22(19,3)4)21(23)25-14-17-12-18(24-13-17)11-16-8-6-5-7-9-16/h5-10,12-13,19-20H,11,14H2,1-4H3
51 atoms
O  1.707635 -2.073119 -0.06679
O  0.996222 -0.967476 -1.878819
O  -2.324409 -2.744914 1.420106
C  1.794838 1.464141 -0.046984
C  2.778227 1.301699 -1.170048
C  2.434944 0.111421 -0.302409
C  2.205203 2.166173 1.22595
C  0.343284 1.698461 -0.391667
C  4.137939 1.868211 -1.125503
C  1.639671 -1.003098 -0.861306
C  4.807171 2.438175 -2.130461
C  6.191417 2.977301 -1.918788
C  4.285706 2.602211 -3.525989
C  0.840161 -3.173801 -0.36133
C  -0.54867 -2.901019 0.097913
C  -1.589112 -2.20432 -0.595541
C  -1.065325 -3.200434 1.313499
C  -2.638016 -2.135834 0.255828
C  -3.960122 -1.463236 0.169386
C  -3.992212 -0.197655 0.994785
C  -4.629251 -0.15828 2.227837
C  -3.337551 0.943707 0.541948
C  -4.615178 0.998801 2.995096
C  -3.322101 2.100594 1.303491
C  -3.961313 2.131048 2.535624
H  2.314963 1.262692 -2.149422
H  3.173199 -0.189351 0.432926
H  1.546046 1.875461 2.045551
H  2.131243 3.24869 1.107429
H  3.224851 1.938094 1.533439
H  0.06241 1.272251 -1.35154
H  0.148276 2.771956 -0.432999
H  -0.312161 1.272121 0.370598
H  4.644981 1.808688 -0.166825
H  6.234569 4.046622 -2.141475
H  6.536104 2.835525 -0.895099
H  6.910028 2.492519 -2.584491
H  4.270277 3.657957 -3.808296
H  4.941331 2.100243 -4.241763
H  3.281912 2.209864 -3.66989
H  1.267886 -4.014886 0.183168
H  0.866898 -3.41017 -1.425973
H  -1.541349 -1.799293 -1.592373
H  -0.661878 -3.718095 2.169111
H  -4.756374 -2.140978 0.488302
H  -4.15111 -1.231224 -0.880044
H  -5.138609 -1.04077 2.595852
H  -2.827118 0.92277 -0.414121
H  -5.114608 1.013399 3.955055
H  -2.808808 2.97939 0.934874
H  -3.949445 3.03332 3.132762
totalener: -1079.73245222 hartree
nucrepener: 2131.27037213 hartree
electener: -3211.00282435 hartree
oneelecener: -5700.90220116 hartree
twoeener: 2489.89937681 hartree
kineticenergy: 1074.91199645 hartree
xcener: -106.467768879316 hartree
chargesum: -0.0000000
charge: -0.258779 -0.401941 -0.249207 0.106557 0.039407 -0.077707 -0.256768 -0.291948 -0.185987 0.361519 -0.054648 -0.203338 -0.236767 0.046245 -0.055282 -0.286970 -0.031534 0.236846 -0.135322 0.101447 -0.150070 -0.205305 -0.121478 -0.124474 -0.132618 0.088312 0.069761 0.094518 0.091614 0.072006 0.097173 0.087794 0.097723 0.069375 0.082902 0.075942 0.084117 0.084012 0.085938 0.083871 0.099000 0.113333 0.143659 0.134497 0.097702 0.109783 0.105774 0.124897 0.122922 0.127273 0.124225
qa: -0.2588 -0.4019 -0.2492 0.1066 0.0394 -0.0777 -0.2568 -0.2919 -0.1860 0.3615 -0.0546 -0.2033 -0.2368 0.0462 -0.0553 -0.2870 -0.0315 0.2368 -0.1353 0.1014 -0.1501 -0.2053 -0.1215 -0.1245 -0.1326 0.0883 0.0698 0.0945 0.0916 0.0720 0.0972 0.0878 0.0977 0.0694 0.0829 0.0759 0.0841 0.0840 0.0859 0.0839 0.0990 0.1133 0.1437 0.1345 0.0977 0.1098 0.1058 0.1249 0.1229 0.1273 0.1242
va: 2.1325 2.1027 2.3123 3.7371 3.7978 3.8548 3.9121 3.9224 3.9094 4.2361 3.8312 3.9338 3.9444 3.9057 3.7005 4.0067 3.9987 3.5875 3.8843 3.5982 4.0120 3.9852 3.9576 3.9511 3.9678 1.0320 1.0370 1.0038 1.0033 1.0113 1.0213 1.0017 0.9953 1.0221 0.9981 1.0123 0.9983 0.9990 0.9990 1.0166 0.9968 1.0055 1.0244 1.0071 1.0130 1.0077 1.0125 1.0007 1.0004 0.9993 0.9997
dispcorr: -0.024257545 hartree
energy: -1079.756709768151
dipole: 19.03736 -18.85333 0.18403 21.15284 -21.00516 0.14769 -6.35780 6.73318 0.37537
magnitude: 0.44338 au
magnitude: 1.12698 debye
