program: Orca
programVersion: 5.0.2
elementType: O O O C C C C C C C C C C C C C C C C C C C C C C H H H H H H H H H H H H H H H H H H H H H H H H H H
charge: 0
multiplicity: 1
keywords: wb97x-d3
keywords: def2-TZVPP
keywords: def2/J RIJCOSX
keywords: DEFGRID2
keywords: scfconv7
keywords: smallprint printgap noloewdin
keywords: NOSOSCF
formula: C22H26O3
InChI: InChI=1/C22H26O3/c1-15(2)10-19-20(22(19,3)4)21(23)25-14-17-12-18(24-13-17)11-16-8-6-5-7-9-16/h5-10,12-13,19-20H,11,14H2,1-4H3
51 atoms
O  1.323078 -1.975373 -1.098934
O  0.305147 -0.015617 -1.470555
O  -1.805147 -3.575017 1.560132
C  2.641545 1.000295 0.374499
C  2.907773 1.363484 -1.056708
C  2.56883 -0.067342 -0.701385
C  3.796255 0.890755 1.341488
C  1.382705 1.521078 1.024896
C  4.257206 1.681271 -1.560367
C  1.276446 -0.642594 -1.133485
C  4.604801 2.709906 -2.336775
C  6.026317 2.88642 -2.78204
C  3.661396 3.762359 -2.834576
C  0.12627 -2.69432 -1.416366
C  -0.790359 -2.787001 -0.249202
C  -1.7085 -1.801081 0.235997
C  -0.900566 -3.835134 0.599941
C  -2.291637 -2.33303 1.334722
C  -3.307972 -1.814708 2.29233
C  -3.767315 -0.437816 1.898078
C  -3.014013 0.681932 2.235586
C  -4.925208 -0.262725 1.150374
C  -3.409508 1.948474 1.834806
C  -5.326565 1.003012 0.749379
C  -4.568461 2.112653 1.090139
H  2.088619 1.891598 -1.53203
H  3.391928 -0.77376 -0.697322
H  3.516078 0.278437 2.200184
H  4.077809 1.87779 1.712846
H  4.684453 0.442815 0.898133
H  1.042546 0.843507 1.810836
H  0.563321 1.653586 0.323147
H  1.586045 2.488163 1.488623
H  5.044911 0.991707 -1.27104
H  6.101634 2.870525 -3.872122
H  6.424788 3.850809 -2.457252
H  6.679286 2.106793 -2.39177
H  3.657569 3.792238 -3.926883
H  2.635064 3.621533 -2.504387
H  3.981436 4.751885 -2.498978
H  0.469082 -3.686068 -1.710136
H  -0.373761 -2.240685 -2.273452
H  -1.897281 -0.827905 -0.184273
H  -0.41457 -4.797176 0.637191
H  -2.887607 -1.796061 3.303279
H  -4.162231 -2.497332 2.334218
H  -2.104002 0.559848 2.811211
H  -5.518294 -1.126703 0.875369
H  -2.810781 2.808933 2.10334
H  -6.231771 1.121215 0.168364
H  -4.878614 3.100795 0.776946
totalener: -1079.73355545 hartree
nucrepener: 2107.25068213 hartree
electener: -3186.98423758 hartree
oneelecener: -5652.94476208 hartree
twoeener: 2465.96052450 hartree
kineticenergy: 1074.91189259 hartree
xcener: -106.468185277361 hartree
chargesum: -0.0000000
charge: -0.259194 -0.401966 -0.255859 0.091977 0.045295 -0.094637 -0.245467 -0.266004 -0.185593 0.365343 -0.054505 -0.203221 -0.235978 0.050963 -0.082647 -0.228234 -0.035807 0.173875 -0.054101 0.027999 -0.167130 -0.149344 -0.116358 -0.121718 -0.124591 0.089633 0.069993 0.090679 0.091639 0.070253 0.083029 0.099984 0.086440 0.070022 0.084565 0.082601 0.075931 0.086299 0.083402 0.083994 0.095555 0.113416 0.162595 0.134721 0.095216 0.089661 0.109440 0.107314 0.122886 0.123630 0.124004
qa: -0.2592 -0.4020 -0.2559 0.0920 0.0453 -0.0946 -0.2455 -0.2660 -0.1856 0.3653 -0.0545 -0.2032 -0.2360 0.0510 -0.0826 -0.2282 -0.0358 0.1739 -0.0541 0.0280 -0.1671 -0.1493 -0.1164 -0.1217 -0.1246 0.0896 0.0700 0.0907 0.0916 0.0703 0.0830 0.1000 0.0864 0.0700 0.0846 0.0826 0.0759 0.0863 0.0834 0.0840 0.0956 0.1134 0.1626 0.1347 0.0952 0.0897 0.1094 0.1073 0.1229 0.1236 0.1240
va: 2.1344 2.1000 2.3016 3.7459 3.7794 3.8836 3.9116 3.9171 3.8980 4.2125 3.8272 3.9347 3.9452 3.9106 3.7330 3.9538 3.9959 3.6802 3.8628 3.6661 3.9816 3.9908 3.9540 3.9660 3.9587 1.0350 1.0384 1.0043 1.0040 1.0114 1.0033 1.0219 1.0012 1.0218 0.9981 0.9984 1.0123 0.9989 1.0159 0.9993 0.9969 1.0054 1.0110 1.0079 1.0056 1.0104 1.0108 1.0116 1.0009 1.0007 0.9999
dispcorr: -0.023114193 hartree
energy: -1079.756669647455
dipole: 22.20690 -21.83837 0.36853 20.54875 -20.55506 -0.00631 -4.01685 4.17771 0.16086
magnitude: 0.40215 au
magnitude: 1.02219 debye
