program: Orca
programVersion: 5.0.2
elementType: O O O C C C C C C C C C C C C C C C C C C C C C C H H H H H H H H H H H H H H H H H H H H H H H H H H
charge: 0
multiplicity: 1
keywords: wb97x-d3
keywords: def2-TZVPP
keywords: def2/J RIJCOSX
keywords: DEFGRID2
keywords: scfconv7
keywords: smallprint printgap noloewdin
keywords: NOSOSCF
formula: C22H26O3
InChI: InChI=1/C22H26O3/c1-15(2)10-19-20(22(19,3)4)21(23)25-14-17-12-18(24-13-17)11-16-8-6-5-7-9-16/h5-10,12-13,19-20H,11,14H2,1-4H3
51 atoms
O  1.4197 -2.085432 -0.994752
O  2.207509 -1.347738 0.964699
O  -2.10915 -1.879613 1.639148
C  4.271257 0.074982 -0.9297
C  3.26857 1.062553 -0.410223
C  2.786702 -0.214088 -1.059876
C  5.003566 0.375683 -2.215319
C  5.116481 -0.682228 0.065025
C  3.014989 2.360148 -1.068915
C  2.124143 -1.246439 -0.232517
C  3.122875 3.567166 -0.509233
C  2.820829 4.810408 -1.292019
C  3.544247 3.809551 0.908353
C  0.715287 -3.135369 -0.323321
C  -0.582504 -2.676643 0.241728
C  -1.849948 -2.631254 -0.420889
C  -0.813876 -2.20318 1.489705
C  -2.739486 -2.144215 0.475842
C  -4.194175 -1.857242 0.398956
C  -4.530026 -0.38918 0.522561
C  -3.963691 0.538406 -0.346787
C  -5.42184 0.05896 1.487555
C  -4.288231 1.881704 -0.256589
C  -5.749756 1.404595 1.581634
C  -5.186049 2.319814 0.707769
H  3.167202 1.056009 0.669664
H  2.39211 -0.129244 -2.066712
H  5.387145 -0.543758 -2.660773
H  5.852991 1.033957 -2.024608
H  4.374665 0.863172 -2.95888
H  4.616001 -0.834251 1.017576
H  6.037717 -0.12922 0.256429
H  5.397727 -1.661573 -0.326963
H  2.707853 2.317631 -2.11009
H  2.532749 4.590079 -2.319121
H  2.007505 5.376114 -0.83039
H  3.685934 5.477472 -1.321273
H  2.768014 4.34841 1.457077
H  3.768368 2.898667 1.458452
H  4.438138 4.437535 0.939109
H  1.343634 -3.576958 0.451039
H  0.548458 -3.889678 -1.091561
H  -2.065857 -2.93141 -1.434184
H  -0.165053 -2.036723 2.333461
H  -4.728387 -2.419399 1.170437
H  -4.555266 -2.239521 -0.559038
H  -3.254762 0.205199 -1.095822
H  -5.864786 -0.649889 2.177236
H  -3.839143 2.589828 -0.940901
H  -6.445227 1.736285 2.341591
H  -5.440425 3.369124 0.778817
totalener: -1079.73326462 hartree
nucrepener: 2067.20274649 hartree
electener: -3146.93601111 hartree
oneelecener: -5572.84457789 hartree
twoeener: 2425.90856678 hartree
kineticenergy: 1074.91206108 hartree
xcener: -106.466868805451 hartree
chargesum: 0.0000000
charge: -0.262827 -0.410146 -0.246426 0.100508 0.036939 -0.115967 -0.237857 -0.264736 -0.190100 0.369170 -0.041764 -0.207593 -0.236508 0.061767 -0.068311 -0.290421 0.004503 0.210976 -0.111220 0.049651 -0.152287 -0.144019 -0.128883 -0.122098 -0.131401 0.089882 0.069483 0.090034 0.090645 0.071021 0.100212 0.083850 0.084783 0.073344 0.076027 0.085819 0.083079 0.087575 0.083184 0.083576 0.112542 0.100832 0.126578 0.150386 0.091768 0.104134 0.116077 0.104646 0.123701 0.122338 0.123537
qa: -0.2628 -0.4101 -0.2464 0.1005 0.0369 -0.1160 -0.2379 -0.2647 -0.1901 0.3692 -0.0418 -0.2076 -0.2365 0.0618 -0.0683 -0.2904 0.0045 0.2110 -0.1112 0.0497 -0.1523 -0.1440 -0.1289 -0.1221 -0.1314 0.0899 0.0695 0.0900 0.0906 0.0710 0.1002 0.0838 0.0848 0.0733 0.0760 0.0858 0.0831 0.0876 0.0832 0.0836 0.1125 0.1008 0.1266 0.1504 0.0918 0.1041 0.1161 0.1046 0.1237 0.1223 0.1235
va: 2.1369 2.0883 2.3213 3.7291 3.7724 3.9198 3.9127 3.9121 3.9010 4.2097 3.8062 3.9368 3.9481 3.8633 3.6656 4.0396 3.9754 3.6355 3.8822 3.6900 3.9883 3.9941 3.9690 3.9630 3.9614 1.0369 1.0400 1.0047 1.0051 1.0105 1.0223 1.0016 1.0024 1.0198 1.0120 0.9978 0.9985 0.9992 1.0143 0.9996 1.0109 0.9958 1.0163 1.0147 1.0107 1.0030 1.0119 1.0114 1.0011 1.0010 1.0002
dispcorr: -0.021685944 hartree
energy: -1079.754950561595
dipole: 22.67768 -22.67639 0.00129 18.31518 -18.22074 0.09445 -6.59523 5.97826 -0.61697
magnitude: 0.62416 au
magnitude: 1.58650 debye
