program: Orca
programVersion: 5.0.2
elementType: O O O C C C C C C C C C C C C C C C C C C C C C C H H H H H H H H H H H H H H H H H H H H H H H H H H
charge: 0
multiplicity: 1
keywords: wb97x-d3
keywords: def2-TZVPP
keywords: def2/J RIJCOSX
keywords: DEFGRID2
keywords: scfconv7
keywords: smallprint printgap noloewdin
keywords: NOSOSCF
formula: C22H26O3
InChI: InChI=1/C22H26O3/c1-15(2)10-19-20(22(19,3)4)21(23)25-14-17-12-18(24-13-17)11-16-8-6-5-7-9-16/h5-10,12-13,19-20H,11,14H2,1-4H3
51 atoms
O  1.421444 -2.220413 -1.290892
O  2.072634 -2.000508 0.839326
O  -2.133428 -3.239347 1.286531
C  3.485404 0.617627 -0.120867
C  2.07792 0.968774 0.248742
C  2.336823 -0.181135 -0.700969
C  4.211073 1.503492 -1.105178
C  4.393711 0.032291 0.932763
C  1.36994 2.174454 -0.254064
C  1.962155 -1.544254 -0.266457
C  1.562752 3.418783 0.186019
C  0.772569 4.568944 -0.36123
C  2.556874 3.771282 1.249673
C  0.741302 -3.43351 -0.980158
C  -0.504823 -3.153166 -0.21526
C  -1.408642 -2.068666 -0.44447
C  -0.998583 -3.820619 0.850484
C  -2.369346 -2.16597 0.503867
C  -3.560449 -1.330525 0.822517
C  -3.447145 0.051423 0.233547
C  -2.44661 0.918517 0.666978
C  -4.327301 0.489197 -0.747066
C  -2.333412 2.192291 0.13601
C  -4.217636 1.765924 -1.283073
C  -3.221365 2.621262 -0.841983
H  1.788083 0.644119 1.245536
H  2.124818 0.022052 -1.745245
H  5.014652 0.95181 -1.595963
H  4.658635 2.357879 -0.593544
H  3.552165 1.897619 -1.877735
H  3.856806 -0.539765 1.684124
H  4.930632 0.837933 1.43818
H  5.140338 -0.624987 0.483644
H  0.617703 2.009429 -1.020576
H  0.199299 5.064199 0.427026
H  1.429276 5.330069 -0.789917
H  0.075425 4.253629 -1.137128
H  3.125962 2.911061 1.597104
H  3.265331 4.520205 0.887118
H  2.057139 4.213816 2.115316
H  1.388261 -4.126052 -0.436816
H  0.517766 -3.873337 -1.952862
H  -1.335177 -1.301782 -1.198207
H  -0.649722 -4.678829 1.401241
H  -3.668238 -1.2625 1.909611
H  -4.473672 -1.813767 0.460653
H  -1.74105 0.58917 1.420507
H  -5.108329 -0.174239 -1.099021
H  -1.546362 2.847906 0.485047
H  -4.913466 2.089538 -2.046045
H  -3.134853 3.617033 -1.257037
totalener: -1079.72876005 hartree
nucrepener: 2192.89058055 hartree
electener: -3272.61934060 hartree
oneelecener: -5824.11635030 hartree
twoeener: 2551.49700970 hartree
kineticenergy: 1074.91587208 hartree
xcener: -106.469643856251 hartree
chargesum: 0.0000000
charge: -0.272989 -0.376462 -0.254502 0.081032 -0.041456 -0.069255 -0.249186 -0.260502 -0.206271 0.328515 -0.018326 -0.240515 -0.250385 0.082809 -0.039540 -0.280987 -0.024039 0.187139 -0.071533 0.036111 -0.187823 -0.145171 -0.122063 -0.108488 -0.149551 0.107549 0.079902 0.096742 0.082705 0.083461 0.104209 0.076650 0.088522 0.103534 0.091077 0.098792 0.079568 0.085758 0.088939 0.097940 0.100082 0.100787 0.141709 0.133615 0.105297 0.084442 0.121134 0.106894 0.148758 0.123241 0.122133
qa: -0.2730 -0.3765 -0.2545 0.0810 -0.0415 -0.0693 -0.2492 -0.2605 -0.2063 0.3285 -0.0183 -0.2405 -0.2504 0.0828 -0.0395 -0.2810 -0.0240 0.1871 -0.0715 0.0361 -0.1878 -0.1452 -0.1221 -0.1085 -0.1496 0.1075 0.0799 0.0967 0.0827 0.0835 0.1042 0.0767 0.0885 0.1035 0.0911 0.0988 0.0796 0.0858 0.0889 0.0979 0.1001 0.1008 0.1417 0.1336 0.1053 0.0844 0.1211 0.1069 0.1488 0.1232 0.1221
va: 2.1155 2.1236 2.3057 3.7612 3.8315 3.8321 3.9069 3.8995 3.8360 4.2335 3.6780 3.9402 3.9398 3.8967 3.7062 3.9920 3.9907 3.6642 3.8397 3.6698 4.0003 3.9761 3.8941 3.9628 3.9727 1.0232 1.0361 1.0064 1.0025 1.0067 1.0246 1.0020 1.0035 1.0039 0.9931 1.0037 1.0092 1.0097 0.9982 1.0037 1.0071 0.9838 1.0130 1.0085 1.0061 1.0069 1.0099 1.0116 0.9764 1.0004 1.0025
dispcorr: -0.026777277 hartree
energy: -1079.755537327793
dipole: 16.22646 -16.29714 -0.07068 24.38770 -23.78022 0.60748 -0.69400 0.20500 -0.48899
magnitude: 0.78303 au
magnitude: 1.99031 debye
