program: Orca
programVersion: 5.0.2
elementType: O O O C C C C C C C C C C C C C C C C C C C C C C H H H H H H H H H H H H H H H H H H H H H H H H H H
charge: 0
multiplicity: 1
keywords: wb97x-d3
keywords: def2-TZVPP
keywords: def2/J RIJCOSX
keywords: DEFGRID2
keywords: scfconv7
keywords: smallprint printgap noloewdin
keywords: NOSOSCF
formula: C22H26O3
InChI: InChI=1/C22H26O3/c1-15(2)10-19-20(22(19,3)4)21(23)25-14-17-12-18(24-13-17)11-16-8-6-5-7-9-16/h5-10,12-13,19-20H,11,14H2,1-4H3
51 atoms
O  1.550011 -1.621153 0.288733
O  1.389976 -1.072878 -1.874411
O  -2.730152 -1.795347 -0.588342
C  2.033104 1.772047 -0.682048
C  3.209895 1.222674 -1.415958
C  2.539251 0.374393 -0.358326
C  2.26323 2.803537 0.396917
C  0.730883 1.96456 -1.420247
C  4.582095 1.753767 -1.20743
C  1.772731 -0.823676 -0.759106
C  5.703391 1.031682 -1.216789
C  7.044915 1.67194 -1.024521
C  5.726815 -0.451798 -1.422906
C  0.738267 -2.777504 0.05749
C  -0.711484 -2.440994 0.064505
C  -1.584938 -2.407023 1.197434
C  -1.473797 -2.056495 -0.987445
C  -2.795573 -2.008747 0.741888
C  -4.08687 -1.731752 1.421039
C  -4.402477 -0.255224 1.487086
C  -3.600559 0.59659 2.241057
C  -5.482921 0.279172 0.798808
C  -3.878717 1.951267 2.310935
C  -5.763307 1.637487 0.863123
C  -4.963134 2.47677 1.621011
H  2.990227 0.897376 -2.430204
H  3.053487 0.284743 0.59185
H  2.311285 3.806833 -0.031943
H  3.189074 2.633935 0.946602
H  1.442728 2.792198 1.116117
H  -0.12181 1.860547 -0.746706
H  0.599766 1.259721 -2.237291
H  0.696152 2.970749 -1.842254
H  4.667633 2.828075 -1.068764
H  7.689893 1.500391 -1.889773
H  6.96811 2.747751 -0.871623
H  7.56319 1.245631 -0.161731
H  6.355876 -0.710183 -2.278284
H  6.161035 -0.957904 -0.556714
H  4.739616 -0.873008 -1.598843
H  0.976173 -3.452391 0.878887
H  1.026822 -3.264837 -0.874546
H  -1.335604 -2.651328 2.218015
H  -1.252905 -1.921606 -2.033078
H  -4.028911 -2.145092 2.430448
H  -4.900473 -2.261704 0.918232
H  -2.745137 0.194454 2.771573
H  -6.111637 -0.371202 0.202494
H  -3.248451 2.600086 2.905164
H  -6.60839 2.038429 0.318923
H  -5.181043 3.535261 1.67459
totalener: -1079.73235012 hartree
nucrepener: 2100.24788099 hartree
electener: -3179.98023111 hartree
oneelecener: -5638.93607042 hartree
twoeener: 2458.95583930 hartree
kineticenergy: 1074.91181200 hartree
xcener: -106.466252586012 hartree
chargesum: -0.0000000
charge: -0.261316 -0.403928 -0.247640 0.127815 -0.020793 -0.115216 -0.275992 -0.258721 -0.235872 0.352905 -0.006708 -0.211675 -0.225379 0.063206 -0.074260 -0.281741 -0.001583 0.217728 -0.130379 0.068835 -0.158429 -0.147410 -0.129141 -0.120821 -0.131633 0.106037 0.085137 0.089085 0.084276 0.091616 0.092162 0.096538 0.083059 0.092384 0.086622 0.078502 0.083892 0.089409 0.085532 0.083163 0.097851 0.114324 0.127093 0.152132 0.109983 0.093779 0.110447 0.104806 0.122511 0.123444 0.124362
qa: -0.2613 -0.4039 -0.2476 0.1278 -0.0208 -0.1152 -0.2760 -0.2587 -0.2359 0.3529 -0.0067 -0.2117 -0.2254 0.0632 -0.0743 -0.2817 -0.0016 0.2177 -0.1304 0.0688 -0.1584 -0.1474 -0.1291 -0.1208 -0.1316 0.1060 0.0851 0.0891 0.0843 0.0916 0.0922 0.0965 0.0831 0.0924 0.0866 0.0785 0.0839 0.0894 0.0855 0.0832 0.0979 0.1143 0.1271 0.1521 0.1100 0.0938 0.1104 0.1048 0.1225 0.1234 0.1244
va: 2.1312 2.0929 2.3166 3.7435 3.8196 3.8356 3.9089 3.9024 3.8935 4.1968 3.7360 3.9415 3.9413 3.8632 3.6880 4.0467 3.9665 3.6316 3.8836 3.6493 3.9895 4.0049 3.9713 3.9610 3.9612 1.0262 1.0315 1.0015 1.0052 1.0063 1.0018 1.0210 1.0032 1.0095 0.9987 1.0098 0.9990 1.0019 1.0009 1.0179 0.9955 1.0100 1.0156 1.0143 1.0043 1.0136 1.0126 1.0120 1.0010 1.0008 1.0000
dispcorr: -0.023150949 hartree
energy: -1079.755501073506
dipole: 23.38687 -23.19474 0.19212 13.76886 -13.70712 0.06174 -1.29487 2.00006 0.70519
magnitude: 0.73350 au
magnitude: 1.86440 debye
