program: Orca
programVersion: 5.0.2
elementType: O O O C C C C C C C C C C C C C C C C C C C C C C H H H H H H H H H H H H H H H H H H H H H H H H H H
charge: 0
multiplicity: 1
keywords: wb97x-d3
keywords: def2-TZVPP
keywords: def2/J RIJCOSX
keywords: DEFGRID2
keywords: scfconv7
keywords: smallprint printgap noloewdin
keywords: NOSOSCF
formula: C22H26O3
InChI: InChI=1/C22H26O3/c1-15(2)10-19-20(22(19,3)4)21(23)25-14-17-12-18(24-13-17)11-16-8-6-5-7-9-16/h5-10,12-13,19-20H,11,14H2,1-4H3
51 atoms
O  1.20086 -1.623375 -1.266722
O  0.733853 0.51321 -1.739784
O  -2.317284 -2.271104 1.44678
C  3.375944 0.932284 -0.086745
C  3.610981 1.170718 -1.546643
C  2.95263 -0.110727 -1.110436
C  4.545417 0.545296 0.785283
C  2.343617 1.765782 0.632385
C  4.965635 1.141214 -2.156977
C  1.522262 -0.336829 -1.412053
C  5.851662 2.134979 -2.079729
C  7.188959 2.050235 -2.750731
C  5.590323 3.408637 -1.335196
C  -0.162567 -1.994689 -1.494018
C  -1.017232 -1.802209 -0.291328
C  -1.45543 -0.578317 0.310587
C  -1.575503 -2.78671 0.45138
C  -2.238328 -0.926058 1.357741
C  -3.027418 -0.12824 2.333181
C  -4.506655 -0.149801 2.028295
C  -5.041636 0.733648 1.0967
C  -5.35057 -1.066816 2.642426
C  -6.392396 0.706689 0.789036
C  -6.703574 -1.098289 2.336099
C  -7.228262 -0.211091 1.40874
H  2.917825 1.876401 -1.998534
H  3.562854 -1.007755 -1.120224
H  5.26924 -0.076109 0.260116
H  4.201923 -0.003709 1.663681
H  5.073686 1.434554 1.135264
H  1.888492 1.206079 1.451663
H  1.547127 2.110531 -0.02239
H  2.821954 2.647156 1.064366
H  5.231264 0.253785 -2.724419
H  7.999691 2.165745 -2.027239
H  7.330159 1.100686 -3.265578
H  7.311218 2.85072 -3.484681
H  6.34314 3.565764 -0.558735
H  5.655172 4.268947 -2.006111
H  4.611095 3.42961 -0.860978
H  -0.125412 -3.05087 -1.760139
H  -0.563848 -1.445403 -2.347255
H  -1.219701 0.422347 -0.010015
H  -1.532922 -3.862118 0.384118
H  -2.656789 0.89788 2.304706
H  -2.849519 -0.493816 3.348231
H  -4.392826 1.449086 0.605065
H  -4.946871 -1.763891 3.36686
H  -6.793653 1.403963 0.065115
H  -7.34872 -1.81757 2.823543
H  -8.28366 -0.232356 1.171063
totalener: -1079.73225854 hartree
nucrepener: 2049.87417285 hartree
electener: -3129.60643140 hartree
oneelecener: -5538.10911122 hartree
twoeener: 2408.50267983 hartree
kineticenergy: 1074.90973293 hartree
xcener: -106.465713358660 hartree
chargesum: 0.0000000
charge: -0.259167 -0.404928 -0.254717 0.080757 -0.028112 -0.092570 -0.249455 -0.277049 -0.193244 0.363397 -0.021886 -0.211336 -0.243564 0.057698 -0.062324 -0.273416 -0.037646 0.237563 -0.141242 0.092452 -0.166440 -0.159063 -0.122781 -0.122069 -0.135399 0.108948 0.080536 0.082756 0.098507 0.083909 0.093820 0.099542 0.082390 0.089612 0.083776 0.079230 0.086534 0.087307 0.097660 0.083041 0.092122 0.115214 0.150430 0.133769 0.104890 0.103301 0.108897 0.107235 0.123723 0.123352 0.124042
qa: -0.2592 -0.4049 -0.2547 0.0808 -0.0281 -0.0926 -0.2495 -0.2770 -0.1932 0.3634 -0.0219 -0.2113 -0.2436 0.0577 -0.0623 -0.2734 -0.0376 0.2376 -0.1412 0.0925 -0.1664 -0.1591 -0.1228 -0.1221 -0.1354 0.1089 0.0805 0.0828 0.0985 0.0839 0.0938 0.0995 0.0824 0.0896 0.0838 0.0792 0.0865 0.0873 0.0977 0.0830 0.0921 0.1152 0.1504 0.1338 0.1049 0.1033 0.1089 0.1072 0.1237 0.1234 0.1240
va: 2.1365 2.0945 2.3121 3.7228 3.8128 3.8657 3.9049 3.9051 3.8591 4.2290 3.7384 3.9390 3.9361 3.9029 3.7464 4.0320 4.0009 3.6050 3.8855 3.6070 4.0051 4.0172 3.9668 3.9552 3.9620 1.0261 1.0339 1.0075 1.0052 1.0020 1.0028 1.0199 1.0041 1.0134 0.9989 1.0106 0.9980 0.9989 1.0036 1.0107 0.9979 1.0047 1.0216 1.0072 1.0101 1.0107 1.0115 1.0142 1.0004 1.0003 1.0000
dispcorr: -0.023190682 hartree
energy: -1079.755449226137
dipole: 29.69435 -29.16533 0.52902 15.90463 -15.99812 -0.09348 -2.07626 2.32632 0.25006
magnitude: 0.59257 au
magnitude: 1.50619 debye
