program: Orca
programVersion: 5.0.2
elementType: O O O C C C C C C C C C C C C C C C C C C C C C C H H H H H H H H H H H H H H H H H H H H H H H H H H
charge: 0
multiplicity: 1
keywords: wb97x-d3
keywords: def2-TZVPP
keywords: def2/J RIJCOSX
keywords: DEFGRID2
keywords: scfconv7
keywords: smallprint printgap noloewdin
keywords: NOSOSCF
formula: C22H26O3
InChI: InChI=1/C22H26O3/c1-15(2)10-19-20(22(19,3)4)21(23)25-14-17-12-18(24-13-17)11-16-8-6-5-7-9-16/h5-10,12-13,19-20H,11,14H2,1-4H3
51 atoms
O  1.787164 -2.033192 -0.437218
O  2.188015 -0.935457 1.471695
O  -2.38684 -0.768185 -0.772821
C  4.790242 0.042817 0.037359
C  3.703839 1.036543 -0.194413
C  3.452173 -0.430631 -0.49676
C  5.928244 -0.025211 -0.953716
C  5.216264 -0.265221 1.451642
C  3.7499 2.029053 -1.297789
C  2.440848 -1.140809 0.311452
C  2.722069 2.364608 -2.07921
C  2.871019 3.391178 -3.161494
C  1.354836 1.761383 -1.960201
C  0.620852 -2.642916 0.126313
C  -0.556618 -1.739112 0.022936
C  -0.915236 -0.645407 0.875153
C  -1.492857 -1.753754 -0.95504
C  -2.030889 -0.095019 0.342291
C  -2.898551 1.035312 0.762024
C  -4.304308 0.593257 1.090467
C  -4.54569 -0.194773 2.21168
C  -5.372609 0.943047 0.276055
C  -5.828932 -0.618342 2.514694
C  -6.660224 0.518947 0.574933
C  -6.891868 -0.262115 1.695508
H  3.212894 1.376225 0.714853
H  3.446185 -0.697191 -1.547341
H  6.385372 -1.015934 -0.943883
H  6.704973 0.698536 -0.697952
H  5.605829 0.182466 -1.974207
H  4.403194 -0.175022 2.166629
H  6.007448 0.424594 1.752219
H  5.617858 -1.277607 1.525716
H  4.699931 2.533059 -1.45371
H  2.609644 2.972261 -4.136958
H  2.197796 4.236231 -2.996363
H  3.887279 3.778844 -3.223776
H  1.230355 1.132426 -1.082151
H  0.593974 2.54394 -1.915199
H  1.120677 1.154639 -2.839053
H  0.803236 -2.942225 1.159083
H  0.463606 -3.544075 -0.465397
H  -0.398334 -0.320227 1.762575
H  -1.63806 -2.38878 -1.814464
H  -2.925343 1.800374 -0.019451
H  -2.435584 1.503036 1.633398
H  -3.718185 -0.484578 2.848791
H  -5.198212 1.551559 -0.603229
H  -6.001033 -1.228729 3.391599
H  -7.482079 0.798747 -0.071108
H  -7.894834 -0.59296 1.930775
totalener: -1079.73143741 hartree
nucrepener: 2104.77441545 hartree
electener: -3184.50585286 hartree
oneelecener: -5647.92393220 hartree
twoeener: 2463.41807934 hartree
kineticenergy: 1074.91893433 hartree
xcener: -106.467502306821 hartree
chargesum: -0.0000000
charge: -0.259147 -0.405535 -0.249003 0.140307 -0.023564 -0.120774 -0.271309 -0.258566 -0.239373 0.348626 -0.008367 -0.213279 -0.197007 0.055008 -0.058653 -0.290468 -0.035110 0.228920 -0.117230 0.064586 -0.159953 -0.140966 -0.127603 -0.126394 -0.129703 0.103538 0.088282 0.090914 0.088668 0.085220 0.101557 0.080833 0.083151 0.092784 0.084725 0.086972 0.078399 0.067644 0.085280 0.089485 0.112183 0.098161 0.149354 0.134899 0.093631 0.110619 0.113823 0.103527 0.124107 0.122812 0.123990
qa: -0.2591 -0.4055 -0.2490 0.1403 -0.0236 -0.1208 -0.2713 -0.2586 -0.2394 0.3486 -0.0084 -0.2133 -0.1970 0.0550 -0.0587 -0.2905 -0.0351 0.2289 -0.1172 0.0646 -0.1600 -0.1410 -0.1276 -0.1264 -0.1297 0.1035 0.0883 0.0909 0.0887 0.0852 0.1016 0.0808 0.0832 0.0928 0.0847 0.0870 0.0784 0.0676 0.0853 0.0895 0.1122 0.0982 0.1494 0.1349 0.0936 0.1106 0.1138 0.1035 0.1241 0.1228 0.1240
va: 2.1181 2.0865 2.3097 3.7148 3.8278 3.8347 3.9102 3.8988 3.8895 4.1858 3.7615 3.9413 3.9418 3.8915 3.7040 3.9903 3.9967 3.5924 3.8705 3.6506 3.9953 4.0007 3.9671 3.9643 3.9583 1.0269 1.0317 1.0066 1.0018 1.0050 1.0235 1.0017 1.0026 1.0103 0.9988 0.9988 1.0099 1.0166 1.0036 1.0026 1.0086 0.9970 1.0240 1.0074 1.0094 1.0066 1.0114 1.0122 1.0006 1.0009 1.0000
dispcorr: -0.024005450 hartree
energy: -1079.755442863514
dipole: 20.65084 -20.66323 -0.01239 11.27850 -11.20063 0.07786 -7.30379 6.71703 -0.58676
magnitude: 0.59203 au
magnitude: 1.50483 debye
