program: Orca
programVersion: 5.0.2
elementType: O O O C C C C C C C C C C C C C C C C C C C C C C H H H H H H H H H H H H H H H H H H H H H H H H H H
charge: 0
multiplicity: 1
keywords: wb97x-d3
keywords: def2-TZVPP
keywords: def2/J RIJCOSX
keywords: DEFGRID2
keywords: scfconv7
keywords: smallprint printgap noloewdin
keywords: NOSOSCF
formula: C22H26O3
InChI: InChI=1/C22H26O3/c1-15(2)10-19-20(22(19,3)4)21(23)25-14-17-12-18(24-13-17)11-16-8-6-5-7-9-16/h5-10,12-13,19-20H,11,14H2,1-4H3
51 atoms
O  1.883697 -2.290565 0.352428
O  1.462448 -1.626144 -1.7430
O  -2.40511 -2.561972 -0.324113
C  1.330257 1.102346 -0.134453
C  2.486116 1.082312 -1.096766
C  2.306849 -0.063364 -0.141181
C  1.391996 2.017477 1.063644
C  -0.069846 0.933998 -0.674053
C  3.64958 1.985277 -0.947298
C  1.852537 -1.38209 -0.632235
C  3.970811 2.990112 -1.764437
C  5.191809 3.825781 -1.522518
C  3.169253 3.376578 -2.969982
C  1.105375 -3.473022 0.147591
C  -0.338609 -3.130413 0.242004
C  -1.030582 -2.660613 1.403589
C  -1.229242 -3.037481 -0.771272
C  -2.276426 -2.323975 0.99885
C  -3.418385 -1.666051 1.687923
C  -3.416966 -0.175076 1.441128
C  -2.804814 0.68793 2.343191
C  -3.975876 0.354956 0.283402
C  -2.7520 2.051591 2.097422
C  -3.924537 1.718148 0.03402
C  -3.312169 2.571127 0.940374
H  2.20653 0.842969 -2.117789
H  2.970062 -0.105805 0.716946
H  0.711977 1.668378 1.842726
H  1.087199 3.027793 0.78457
H  2.390345 2.085365 1.494577
H  -0.492729 1.913162 -0.907914
H  -0.725974 0.470023 0.066121
H  -0.106305 0.333046 -1.57999
H  4.297053 1.802274 -0.094146
H  4.93219 4.882142 -1.413438
H  5.728179 3.518632 -0.625372
H  5.885623 3.761858 -2.36499
H  2.837155 4.414433 -2.891184
H  3.773589 3.31297 -3.877785
H  2.284306 2.761298 -3.112588
H  1.410429 -4.149588 0.945391
H  1.342655 -3.943812 -0.807789
H  -0.635491 -2.565066 2.402295
H  -1.15475 -3.248559 -1.825173
H  -3.339486 -1.867224 2.757449
H  -4.363175 -2.104557 1.356748
H  -2.361831 0.289158 3.248328
H  -4.452067 -0.303883 -0.43252
H  -2.274571 2.70921 2.812047
H  -4.364839 2.115094 -0.871344
H  -3.273754 3.634936 0.746948
totalener: -1079.73026435 hartree
nucrepener: 2197.10216268 hartree
electener: -3276.83242702 hartree
oneelecener: -5832.70963897 hartree
twoeener: 2555.87721195 hartree
kineticenergy: 1074.91867933 hartree
xcener: -106.468354766457 hartree
chargesum: 0.0000000
charge: -0.265362 -0.379169 -0.251399 0.177431 0.004111 -0.111654 -0.244173 -0.258132 -0.197945 0.319743 -0.031079 -0.211679 -0.237680 0.066117 -0.063539 -0.280792 0.004785 0.218100 -0.137734 0.072584 -0.151670 -0.143794 -0.137191 -0.121311 -0.134762 0.093692 0.070115 0.084580 0.087617 0.074329 0.086904 0.055325 0.100106 0.077730 0.082087 0.077126 0.085790 0.083131 0.087466 0.083191 0.103608 0.105656 0.121866 0.141632 0.098226 0.108924 0.102041 0.111538 0.124997 0.123743 0.124773
qa: -0.2654 -0.3792 -0.2514 0.1774 0.0041 -0.1117 -0.2442 -0.2581 -0.1979 0.3197 -0.0311 -0.2117 -0.2377 0.0661 -0.0635 -0.2808 0.0048 0.2181 -0.1377 0.0726 -0.1517 -0.1438 -0.1372 -0.1213 -0.1348 0.0937 0.0701 0.0846 0.0876 0.0743 0.0869 0.0553 0.1001 0.0777 0.0821 0.0771 0.0858 0.0831 0.0875 0.0832 0.1036 0.1057 0.1219 0.1416 0.0982 0.1089 0.1020 0.1115 0.1250 0.1237 0.1248
va: 2.1122 2.1253 2.2999 3.6757 3.7994 3.9085 3.9049 3.9159 3.8958 4.2914 3.7742 3.9390 3.9477 3.8993 3.7053 4.0224 3.9716 3.6066 3.8735 3.6172 3.9436 3.9873 3.9329 3.9502 3.9293 1.0306 1.0391 1.0076 1.0060 1.0120 1.0051 1.0052 1.0256 1.0175 0.9986 1.0115 0.9974 0.9997 0.9996 1.0132 0.9913 1.0099 1.0204 1.0119 1.0131 1.0120 1.0126 1.0174 1.0004 1.0004 1.0001
dispcorr: -0.027353131 hartree
energy: -1079.757617480547
dipole: 13.12941 -13.30911 -0.17969 23.35848 -22.99307 0.36541 -3.04755 3.71258 0.66503
magnitude: 0.77980 au
magnitude: 1.98209 debye
