program: Orca
programVersion: 5.0.2
elementType: O O O C C C C C C C C C C C C C C C C C C C C C C H H H H H H H H H H H H H H H H H H H H H H H H H H
charge: 0
multiplicity: 1
keywords: wb97x-d3
keywords: def2-TZVPP
keywords: def2/J RIJCOSX
keywords: DEFGRID2
keywords: scfconv7
keywords: smallprint printgap noloewdin
keywords: NOSOSCF
formula: C22H26O3
InChI: InChI=1/C22H26O3/c1-15(2)10-19-20(22(19,3)4)21(23)25-14-17-12-18(24-13-17)11-16-8-6-5-7-9-16/h5-10,12-13,19-20H,11,14H2,1-4H3
51 atoms
O  1.552723 -1.648718 0.39309
O  1.455119 -1.271368 -1.808821
O  -2.675525 -2.035134 -0.690007
C  1.930872 1.679812 -0.84835
C  3.171446 1.118792 -1.460224
C  2.473298 0.34141 -0.368571
C  2.059065 2.814332 0.140021
C  0.66656 1.74761 -1.670158
C  4.498619 1.74461 -1.227496
C  1.78185 -0.921021 -0.703202
C  5.632467 1.11072 -0.925096
C  6.91326 1.865393 -0.730149
C  5.740617 -0.374616 -0.765187
C  0.776893 -2.838948 0.22292
C  -0.676422 -2.533346 0.128082
C  -1.593326 -2.344785 1.21017
C  -1.399523 -2.326557 -0.997969
C  -2.790378 -2.044849 0.655529
C  -4.113775 -1.685717 1.232485
C  -4.337944 -0.191904 1.267465
C  -4.683909 0.502205 0.112077
C  -4.17016 0.519584 2.4491
C  -4.856358 1.877116 0.139803
C  -4.343984 1.895486 2.481129
C  -4.685782 2.579029 1.324729
H  3.026999 0.695734 -2.45198
H  2.929444 0.360698 0.614788
H  2.074634 3.775893 -0.377677
H  2.968425 2.745642 0.736958
H  1.208756 2.822507 0.823755
H  0.619501 2.707744 -2.187784
H  -0.218272 1.671649 -1.035323
H  0.608217 0.963878 -2.421056
H  4.537625 2.824131 -1.348215
H  6.780824 2.938744 -0.860162
H  7.32036 1.695562 0.26979
H  7.677381 1.532856 -1.437066
H  4.800676 -0.89222 -0.938794
H  6.475504 -0.779361 -1.465507
H  6.092881 -0.634849 0.236243
H  0.985196 -3.435391 1.110403
H  1.120192 -3.398293 -0.648316
H  -1.378331 -2.417029 2.264472
H  -1.138226 -2.345338 -2.042828
H  -4.166382 -2.090718 2.24426
H  -4.910324 -2.172179 0.662817
H  -4.816735 -0.036663 -0.818155
H  -3.900903 -0.007335 3.357012
H  -5.125382 2.403078 -0.766983
H  -4.212944 2.432774 3.411416
H  -4.822856 3.652084 1.346749
totalener: -1079.73164592 hartree
nucrepener: 2109.94637271 hartree
electener: -3189.67801863 hartree
oneelecener: -5658.38981255 hartree
twoeener: 2468.71179392 hartree
kineticenergy: 1074.91210661 hartree
xcener: -106.466187569709 hartree
chargesum: 0.0000000
charge: -0.262704 -0.402315 -0.256370 0.121138 -0.001510 -0.138086 -0.270483 -0.261470 -0.243671 0.360616 -0.007438 -0.210898 -0.226778 0.061177 -0.078234 -0.272814 0.002517 0.230437 -0.138495 0.091513 -0.171544 -0.163889 -0.120186 -0.117080 -0.138732 0.104014 0.091077 0.086852 0.084221 0.094911 0.081977 0.092795 0.096255 0.092267 0.078267 0.083863 0.086450 0.088754 0.091084 0.085672 0.099584 0.113309 0.124207 0.150149 0.091321 0.110347 0.113258 0.102485 0.124630 0.122766 0.124784
qa: -0.2627 -0.4023 -0.2564 0.1211 -0.0015 -0.1381 -0.2705 -0.2615 -0.2437 0.3606 -0.0074 -0.2109 -0.2268 0.0612 -0.0782 -0.2728 0.0025 0.2304 -0.1385 0.0915 -0.1715 -0.1639 -0.1202 -0.1171 -0.1387 0.1040 0.0911 0.0869 0.0842 0.0949 0.0820 0.0928 0.0963 0.0923 0.0783 0.0839 0.0865 0.0888 0.0911 0.0857 0.0996 0.1133 0.1242 0.1501 0.0913 0.1103 0.1133 0.1025 0.1246 0.1228 0.1248
va: 2.1270 2.0968 2.3081 3.7432 3.7941 3.8659 3.9049 3.9059 3.8944 4.1821 3.7465 3.9404 3.9376 3.8702 3.6968 4.0516 3.9639 3.6149 3.8809 3.6294 4.0142 4.0026 3.9552 3.9589 3.9663 1.0266 1.0286 1.0025 1.0059 1.0058 1.0030 1.0011 1.0217 1.0106 1.0100 0.9995 0.9988 1.0139 1.0018 1.0010 0.9943 1.0099 1.0171 1.0141 1.0135 1.0084 1.0199 1.0120 1.0002 1.0006 0.9999
dispcorr: -0.023330906 hartree
energy: -1079.754976828598
dipole: 22.59480 -22.45143 0.14338 14.71124 -14.55365 0.15760 -0.53391 1.25962 0.72571
magnitude: 0.75634 au
magnitude: 1.92246 debye
